{"text_format":"1","workbook":"xlsx","n_sheets":7,"sheets":["Instructions - old","Instructions","Cash Flow Summary","Forecast AP Payments","Forecast AR Collections","Import","Alert"],"not_rendered":{"charts":0,"images":8,"macros":1,"external_links":0,"defined_names":72,"comments":0,"pivot_tables":0},"unopened":[],"bounds":{"document_bytes":16777216,"sheet_cells":100000,"rows_first":2000,"rows_last":500,"rows_between":2000,"halvings":0,"cell_chars":16384,"cell_head_chars":4096},"cells_cut":0,"cells_raw":0,"read":"whole","date_system":"1900"}

{"sheet":"Instructions - old","index":0,"n_rows":36,"n_cols":2,"rows_kept":36,"cut":false,"hidden":true,"merged":[]}
[]
[]
[null,"Cash Flow Forecast Splinter Instructions:"]
[]
[]
[]
[null,"Our cash flow KPI template is designed to make it easy to turn use Aged AR and Aged AP reports from QuickBooks "]
[null,"to help forecast cashflow for a 13 week period. Simply follow these five steps:"]
[]
[null,"1. Enter the first data from the drop down calendar in the first yellow field on the Cash Flow Summary tab (insert screen shot)."]
[null,"The cash flow template will select the same day of the week for the next 13 weeks. "]
[]
[null,"2. Next, enter the opening cash balance from your QuickBooks register in the second yellow field."]
[null,"Do not enter your current bank balance. If you don’t trust this number click here to schedule a free consultation with GrowthForce."]
[]
[null,"3. Go into QuickBooks and download the Aged Accounts Receivable Summary report into the \"Aged AR Download\" tab. "]
[null,"The first time you do that you need to turn off the “instructions” tab."]
[null,"a.\t(SK to get screen shots and confirm once I get into QuickBooks.  I had technical issues today)"]
[]
[null,"4. Before you leave QuickBooks download the Aged Accounts Payable Summary report into the \"Aged AP Download\" tab."]
[null,"(SK to get screen shots)"]
[]
[null,"5. Go to the \"Expected AR Collection\" tab in the Excel file and in the Yellow field in Column J enter the week # (1 through 13) that you"]
[null,"expect to collect on each Receivable. The total from Row 7 will appear as one line item under Sources of Cash on the Cash Flow Summary.\n"]
[null,"a.\tNote this template has 500 rows for AP and AR details. If your Aged AR has more than 500 rows you will need to add more rows in this tab."]
[]
[null,"6. Go to the \"Expected AP Payment\" tab in the Excel file and in the Yellow field in Column J enter the week # (1 through 13) that you"]
[null,"expect to pay each Payable. The total from Row 7 will appear as one line item under Uses of Cash on the Cash Flow Summary.\n"]
[null,"a.\tNote this template has 500 rows for AP and AR details. If your Aged AP has more than 500 rows you will need to add more rows in this tab "]
[]
[null,"7. Finally, go to the Cash Flow Summary tab and enter:\n"]
[null,"a.\tany other Sources of Cash not from AR (loans, increase in credit cards, owners contribution)"]
[null,"b.\tany other Uses of Cash not from AP (rent, payroll, pay down debt or credit cards)"]
[]
[null,"8. Review the ending cash balances and adjust as needed. \n"]
[null,"a.\tIf you need help with billing or collections, click here to schedule a free consultation."]

{"sheet":"Instructions","index":1,"n_rows":28,"n_cols":6,"rows_kept":28,"cut":false,"hidden":false,"merged":[[4,3,4,5],[24,3,24,5],[8,3,8,5],[1,3,3,5]]}
[]
[null,null,null,"Cash Flow Forecast  Instructions"]
[]
[]
[null,null,null,"Our Cash Flow Forecast Template makes it easy to import Aged AR and Aged AP reports from QuickBooks and forecast cashflow for a 13-week period.                                                                                    Follow these simple steps…"]
[]
[null,"STEPS",null,"INSTRUCTIONS",null,"HELPFUL HINTS"]
[]
[null,null,null,"If you need help with improving cash flow, click here to schedule a free consultation with GrowthForce."]
[null,1,null,"Go to the \"Cash Flow Summary\" tab and enter the Start Date in Cell C7. Enter the Opening Cash Balance from your QuickBooks register in Cell D10",null,"TIP:  Enter the bank register balance from QuickBook on the date you just entered. Do not enter your current bank balance.  The template will add 7 days to your start date to create a weekly forecast.  "]
[]
[null,2,null,"In QuickBooks download the Aged Accounts Payable and Aged Accounts Receivable Reports into two Excel files. ",null,"Export TIP: Check settings in Exhibit A below the first time you export to Excel from QuickBooks. Export each report tn to a separate Excei file. Add a date to the exported filename so you import the right file."]
[]
[null,3,null,"On the Forecast AR Collections tab, hit the Import button on top and browse to where you saved the AR Aging Report in Excel.",null,"You can download the Aging reports  either Expanded (with jobs) or Collapsed (no jobs).   You can use any version of QuickBooks (except for Mac).  "]
[]
[null,null,null,"In Column J enter a number 1 - 13 for the week you expect to collect each Receivable.  You can spread collections over >1 week by unlocking with the password 12345. ",null,"TIP: If you unlock the spreadsheet, make sure you know what formulas are overwritten because cells are frozen for a reason. Save a copy of this original template so you can start over if you bust the model, "]
[]
[null,4,null,"Do the same thing on the Forecast AP Payments tab: hit the Import Button and browse to the AP Aging Report you exported to Excel in Step 2.  "]
[]
[null,null,null,"In Colunm I enter a number 1 - 13 for the week you expect to pay each Payable.  You can spread payments over > 1 week  by unlocking with password 12345."]
[]
[null,"5",null,"In Column B enter all non-AR Sources of Cash  (e.g. client deposits, loans, owners $) and all non-AP Uses of Cash  (e.g. rent, payroll, pay credit cards).",null,"Total weekly collections and payments show as one line each as a Source and a Use of Cash.  That number comes from the top of the Forecast AR and AP tabs."]
[]
[null,"6",null,"Review the ending cash balances and take action as needed. ",null,"TIP: This is formatted to print 8 weeks across.  If you Unlock with 12345, you can change print range or column widths like any other Excel file. "]
[null,null,null,"If you don’t trust your numbers, click here to schedule a free consultation with GrowthForce."]
[null,null,null,"Exhibit A."]
[]
[null,null,null,"Export Step 1. Click \"Advanced\" before you export to Excel for the first time",null,"Export Step 2. Make sure the two items circled below are not checked"]

{"sheet":"Cash Flow Summary","index":2,"n_rows":47,"n_cols":16,"rows_kept":47,"cut":false,"hidden":false,"merged":[[6,15,7,15],[6,10,7,10],[6,11,7,11],[6,12,7,12],[6,13,7,13],[6,14,7,14],[6,8,7,8],[6,9,7,9],[6,2,7,2],[6,1,7,1],[6,3,7,3],[6,4,7,4],[6,5,7,5],[3,3,3,6],[2,3,2,6],[9,1,9,2],[6,6,7,6],[6,7,7,7]]}
[]
[]
[null,null,null,"Your Charity Organization  "]
[null,null,null,"Cash Flow Forecast"]
[]
[null,"Version 1.10","1. Enter start date here:","Week 1","Week 2","Week 3","Week 4","Week 5","Week 6","Week 7","Week 8","Week 9","Week 10","Week 11","Week 12","Week 13"]
[null,"Start Date:","2019-09-01",{"$f":"C7","v":"2019-09-01"},{"$f":"D7+7","v":"2019-09-08"},"2019-09-15","2019-09-22","2019-09-29","2019-10-06","2019-10-13","2019-10-20","2019-10-27","2019-11-03","2019-11-10","2019-11-17","2019-11-24"]
[]
[]
[null,"2. Input Qbooks Opening Register Balance: ",null,9468.0300000000007,{"$f":"D43","v":5768.8803999999946},{"$f":"E43","v":19699.179399999994},-5819.3048000000053,27604.054899999996,30838.040299999997,44978.040299999993,76103.040299999993,115753.04029999999,125453.04029999999,132143.04029999999,118318.04029999999,152968.04029999999]
[]
[null,"Add: Sources of Cash"]
[null,"Total from \"Forecast AR\" Collections Tab",null,{"$f":"'Forecast AR Collections'!K8","v":15990},{"$f":"'Forecast AR Collections'!L8","v":4000},{"$f":"'Forecast AR Collections'!M8","v":800},{"$f":"'Forecast AR Collections'!N8","v":1400},{"$f":"'Forecast AR Collections'!O8","v":6250},{"$f":"'Forecast AR Collections'!P8","v":0},{"$f":"'Forecast AR Collections'!Q8","v":0},{"$f":"'Forecast AR Collections'!R8","v":0},{"$f":"'Forecast AR Collections'!S8","v":0},{"$f":"'Forecast AR Collections'!T8","v":0},{"$f":"'Forecast AR Collections'!U8","v":0},{"$f":"'Forecast AR Collections'!V8","v":0},{"$f":"'Forecast AR Collections'!W8","v":0}]
[null,"Operations"]
[null,null,"Programs",7250,7250,7250,7250,7250,7250,7250,7250,7250,7250,7250,7250,7250]
[null,null,"Services",5000,5000,5000,12500,5000,5000,5000,5000,5000,2500,7500,7500,7500]
[null,null,"Special Support Services",2000,2000,2000,2000,2000,2000,2000,2000,2000,2000,2000,2000,2000]
[null,null,"Anex Rental",11000,null,null,12500,2500,null,2500,5000,10000,null,null,12500]
[null,null,"Sales",250,250,250,250,300,350,350,400,450,400,400,400,400]
[null,null,"Sublet",1790,null,null,null,null,1790,null,null,null,1790]
[null,"Development"]
[null,null,"Grants",null,null,null,null,null,null,50000]
[null,null,"Programs",500,1650,1650,1650]
[null,null,"Sustainer",0,1500,1500,1500]
[null,"Events"]
[null,null,"New Years Eve Formal",null,null,null,null,null,null,null,null,null,null,5000,5000,5000]
[null,null,"4th of July Event",1000,500]
[null,null,"Mascarade Ball",null,null,null,null,null,null,null,25000,25000]
[null,"Total Sources of Cash:",null,{"$f":"SUM(D13:D28)","v":44780},{"$f":"SUM(E13:E28)","v":22150},18450,39050,{"$f":"SUM(H13:H28)","v":23300},16390,67100,44650,49700,13940,22150,34650,22150]
[]
[null,"Less: Uses of Cash"]
[null,"Total from \"Forecast AP Payments\" Tab",null,{"$f":"'Forecast AP Payments'!K8","v":32698.149600000001},{"$f":"'Forecast AP Payments'!L8","v":7719.701},{"$f":"'Forecast AP Payments'!M8","v":11493.484200000001},{"$f":"'Forecast AP Payments'!N8","v":5626.6403},{"$f":"'Forecast AP Payments'!O8","v":66.014600000000002},{"$f":"'Forecast AP Payments'!P8","v":0},{"$f":"'Forecast AP Payments'!Q8","v":0},{"$f":"'Forecast AP Payments'!R8","v":0},{"$f":"'Forecast AP Payments'!S8","v":0},{"$f":"'Forecast AP Payments'!T8","v":0},{"$f":"'Forecast AP Payments'!U8","v":0},{"$f":"'Forecast AP Payments'!V8","v":0},{"$f":"'Forecast AP Payments'!W8","v":0}]
[null,"Payroll Cost",null,15250,null,17250,null,17250,null,17250,null,17250,null,17250,null,17250]
[null,"Rent Cost",null,null,null,13850,null,null,null,13850,null,null,5000,13850]
[null,"Contractor Cost",null,null,null,1375,null,null,null,1375,null,20000,null,1375]
[null,"Bank Fees",null,null,null,null,null,250,null,null,null,250,null,null,null,250]
[null,"Insurance",null,null,null,null,null,null,null,3500,5000,null,null,3500]
[null,"Vehicle Leases",null,150,null,null,null,null,750,null,null,null,750]
[null,"Electricity",null,381,null,null,null,2500,null,null,null,2500,null,null,null,2500]
[null,"Cable & Internet",null,null,500,null,null,null,1500,null,null,null,1500,null,null,1500]
[null,"Total Uses of Cash:",null,{"$f":"SUM(D32:D40)","v":48479.149600000004},8219.7010000000009,43968.484199999999,{"$f":"SUM(G32:G40)","v":5626.6403},20066.014599999999,2250,35975,5000,40000,7250,35975,0,21500]
[]
[null,"Ending Operating Register Balance: ",null,{"$f":"D10+D29-D41","v":5768.8803999999946},{"$f":"E10+E29-E41","v":19699.179399999994},-5819.3048000000053,27604.054899999996,{"$f":"H10+H29-H41","v":30838.040299999997},44978.040299999993,76103.040299999993,115753.04029999999,125453.04029999999,132143.04029999999,118318.04029999999,152968.04029999999,153618.04029999999]
[]
[null,"Board Designated Funds",null,5888.46,5910.95,5933.44,5955.93,5978.42,6000.91,6023.4,6045.89,6068.38,6090.87,6113.36,6135.85,6158.34]
[]
[null,"Total Ending Cash Balance",null,{"$f":"D43+D45","v":11657.340399999994},{"$f":"E43+E45","v":25610.129399999994},114.13519999999426,33559.984899999996,{"$f":"H43+H45","v":36816.460299999999},50978.950299999997,82126.440299999987,121798.93029999999,131521.4203,138233.91029999999,124431.40029999999,159103.8903,159776.38029999999]

{"sheet":"Forecast AP Payments","index":3,"n_rows":496,"n_cols":25,"rows_kept":496,"cut":false,"hidden":false,"merged":[[4,8,5,8],[4,9,5,9],[4,23,5,23],[4,24,5,24],[495,9,495,24],[4,7,5,7],[4,2,5,2],[4,3,5,3],[4,4,5,4],[4,5,5,5],[4,6,5,6]]}
[null,null,null,null,null,null,null,null,null,"C:\\Users\\lenovo\\Google Drive\\james dougal (growthforce)\\B. Cash Flow Files\\AP Aging2.xlsx"]
[null,null,null,"Expected AP Payments",null,null,null,null,null,"AP Aging2.xlsx"]
[null,null,null,null,null,null,null,null,null,"C:\\Users\\lenovo\\Google Drive\\james dougal (growthforce)\\B. Cash Flow Files\\"]
[null,null,null,null,null,null,null,null,null,null," <-- Click here to import AP Aging Summary Excel file from Quickbooks download"]
[null,null,"Vendor Name","Current","1 - 30","31 - 60","61 - 90","> 90","Total","Expected Payment  Week (enter wk 1-13)",{"$f":"'Cash Flow Summary'!D6","v":"Week 1"},{"$f":"'Cash Flow Summary'!E6","v":"Week 2"},{"$f":"'Cash Flow Summary'!F6","v":"Week 3"},{"$f":"'Cash Flow Summary'!G6","v":"Week 4"},{"$f":"'Cash Flow Summary'!H6","v":"Week 5"},{"$f":"'Cash Flow Summary'!I6","v":"Week 6"},{"$f":"'Cash Flow Summary'!J6","v":"Week 7"},{"$f":"'Cash Flow Summary'!K6","v":"Week 8"},{"$f":"'Cash Flow Summary'!L6","v":"Week 9"},{"$f":"'Cash Flow Summary'!M6","v":"Week 10"},{"$f":"'Cash Flow Summary'!N6","v":"Week 11"},{"$f":"'Cash Flow Summary'!O6","v":"Week 12"},{"$f":"'Cash Flow Summary'!P6","v":"Week 13"},"Total","Proof"]
[null,null,null,null,null,null,null,null,null,null,{"$f":"'Cash Flow Summary'!D7","v":"2019-09-01"},{"$f":"'Cash Flow Summary'!E7","v":"2019-09-08"},{"$f":"'Cash Flow Summary'!F7","v":"2019-09-15"},{"$f":"'Cash Flow Summary'!G7","v":"2019-09-22"},{"$f":"'Cash Flow Summary'!H7","v":"2019-09-29"},{"$f":"'Cash Flow Summary'!I7","v":"2019-10-06"},{"$f":"'Cash Flow Summary'!J7","v":"2019-10-13"},{"$f":"'Cash Flow Summary'!K7","v":"2019-10-20"},{"$f":"'Cash Flow Summary'!L7","v":"2019-10-27"},{"$f":"'Cash Flow Summary'!M7","v":"2019-11-03"},{"$f":"'Cash Flow Summary'!N7","v":"2019-11-10"},{"$f":"'Cash Flow Summary'!O7","v":"2019-11-17"},{"$f":"'Cash Flow Summary'!P7","v":"2019-11-24"}]
[null,null,{"$f":"'Forecast AR Collections'!$C$7","v":"Version 1.10"}]
[null,"Due Date","Name",{"$f":"ROUND(SUM(D9:D495),5)","v":26966.4097},29567.65,125.35,1211.58,-267,57603.989699999998,null,{"$f":"ROUND(SUM(K9:K1048576),5)","v":32698.149600000001},7719.701,11493.484200000001,5626.6403,66.014600000000002,0,0,0,0,0,0,0,0,57603.989699999998]
[null,"2019-09-15","ABC Insurance",636.74440000000004,null,null,null,null,{"$f":"SUM(D9:H9)","v":636.74440000000004},{"$f":"IF(B9<=K$6,1,ROUNDUP(((B9-K$6)/7),0))","v":2},{"$f":"IF($J9=VALUE(RIGHT(K$5,2)),$I9,0)","v":0},636.74440000000004,0,0,0,0,0,0,0,0,0,0,0,{"$f":"SUM(K9:W9)","v":636.74440000000004},{"$f":"IF(X9=I9,\"Proof\",\"Error\")","v":"Proof"}]
[null,"2019-09-11","Bear Electrical",555.1146,null,null,null,null,555.1146,{"$f":"IF(B10<=K$6,1,ROUNDUP(((B10-K$6)/7),0))","v":2},0,555.1146,0,0,0,0,0,0,0,0,0,0,0,555.1146,"Proof"]
[null,"2019-09-12","Bear Electrical",379.0915,null,null,null,null,379.0915,2,0,379.0915,0,0,0,0,0,0,0,0,0,0,0,379.0915,"Proof"]
[null,"2019-09-27","Bear Electrical",3742.5128000000004,null,null,null,null,3742.5128000000004,4,0,0,0,3742.5128000000004,0,0,0,0,0,0,0,0,0,3742.5128000000004,"Proof"]
[null,"2019-09-11","Bind Services",39.9,null,null,null,null,39.9,2,0,39.9,0,0,0,{"$f":"IF($J13=VALUE(RIGHT(P$5,2)),$I13,0)","v":0},0,0,0,0,0,0,0,39.9,"Proof"]
[null,"2019-09-29","Bright Line PLLC",477,null,null,null,null,477,4,0,0,0,477,0,0,0,0,0,0,0,0,0,477,"Proof"]
[null,"2019-09-29","Bright Line PLLC",642,null,null,null,null,642,4,0,0,0,642,0,0,0,0,0,0,0,0,0,642,"Proof"]
[null,"2019-09-29","Bright Line PLLC",243.00000000000003,null,null,null,null,243.00000000000003,4,0,0,0,243.00000000000003,0,0,0,0,0,0,0,0,0,243.00000000000003,"Proof"]
[null,"2019-09-29","Bright Line PLLC",102.18750000000001,null,null,null,null,102.18750000000001,4,0,0,0,102.18750000000001,0,0,0,0,0,0,0,0,0,102.18750000000001,"Proof"]
[null,"2019-09-29","Bright Line PLLC",82.5,null,null,null,null,82.5,4,0,0,0,82.5,0,0,0,0,0,0,0,0,0,82.5,"Proof"]
[null,"2019-09-29","Bright Line PLLC",337.44000000000005,null,null,null,null,337.44000000000005,4,0,0,0,337.44000000000005,0,0,0,0,0,0,0,0,0,337.44000000000005,"Proof"]
[null,"2019-09-18","Captain, John",1736.0000000000002,null,null,null,null,1736.0000000000002,3,0,0,1736.0000000000002,0,0,0,0,0,0,0,0,0,0,1736.0000000000002,"Proof"]
[null,"2019-09-12","Cattle Energy",45.708500000000008,null,null,null,null,45.708500000000008,2,0,45.708500000000008,0,0,0,0,0,0,0,0,0,0,0,45.708500000000008,"Proof"]
[null,"2019-09-10","Celtic Lines",177.86280000000002,null,null,null,null,177.86280000000002,2,0,177.86280000000002,0,0,0,0,0,0,0,0,0,0,0,177.86280000000002,"Proof"]
[null,"2019-09-17","Celtic Lines",209.15050000000002,null,null,null,null,209.15050000000002,3,0,0,209.15050000000002,0,0,0,0,0,0,0,0,0,0,209.15050000000002,"Proof"]
[null,"2019-09-14","Celtic Lines",4276.8388000000004,null,null,null,null,4276.8388000000004,2,0,4276.8388000000004,0,0,0,0,0,0,0,0,0,0,0,4276.8388000000004,"Proof"]
[null,"2019-09-17","Celtic Lines",522.19440000000009,null,null,null,null,522.19440000000009,3,0,0,522.19440000000009,0,0,0,0,0,0,0,0,0,0,522.19440000000009,"Proof"]
[null,"2019-09-19","City Water",330.89560000000006,null,null,null,null,330.89560000000006,3,0,0,330.89560000000006,0,0,0,0,0,0,0,0,0,0,330.89560000000006,"Proof"]
[null,"2019-09-19","City Water",430.64910000000003,null,null,null,null,430.64910000000003,3,0,0,430.64910000000003,0,0,0,0,0,0,0,0,0,0,430.64910000000003,"Proof"]
[null,"2019-09-06","Cooper, Steve & Lynn",1440.0000000000002,null,null,null,null,1440.0000000000002,1,1440.0000000000002,0,0,0,0,0,0,0,0,0,0,0,0,1440.0000000000002,"Proof"]
[null,"2019-09-18","Copper, Ann",2594.1916000000006,null,null,null,null,2594.1916000000006,3,0,0,2594.1916000000006,0,0,0,0,0,0,0,0,0,0,2594.1916000000006,"Proof"]
[null,"2019-09-18","Davidson, Janette",1403.0000000000002,null,null,null,null,1403.0000000000002,3,0,0,1403.0000000000002,0,0,0,0,0,0,0,0,0,0,1403.0000000000002,"Proof"]
[null,"2019-09-18","Fredrick, Allen",1940.4357000000002,null,null,null,null,1940.4357000000002,3,0,0,1940.4357000000002,0,0,0,0,0,0,0,0,0,0,1940.4357000000002,"Proof"]
[null,"2019-09-18","Halifax",1759.5600000000004,null,null,null,null,1759.5600000000004,3,0,0,1759.5600000000004,0,0,0,0,0,0,0,0,0,0,1759.5600000000004,"Proof"]
[null,"2019-09-20","Paper LLC",222.50000000000003,null,null,null,null,222.50000000000003,3,{"$f":"IF($J33=VALUE(RIGHT(K$5,2)),$I33,0)","v":0},0,222.50000000000003,0,0,0,0,0,0,0,0,0,0,222.50000000000003,"Proof"]
[null,"2019-09-11","Residential Energy Services",1608.4404000000002,null,null,null,null,1608.4404000000002,2,0,1608.4404000000002,0,0,0,0,0,0,0,0,0,0,0,1608.4404000000002,"Proof"]
[null,"2019-10-01","Saddle Ranch",66.014600000000002,null,null,null,null,{"$f":"SUM(D35:H35)","v":66.014600000000002},5,0,0,0,0,66.014600000000002,0,0,0,0,0,0,0,0,66.014600000000002,"Proof"]
[null,"2019-09-07","Total Sources",620.56960000000015,null,null,null,null,{"$f":"SUM(D36:H36)","v":620.56960000000015},1,620.56960000000015,0,0,0,0,0,0,0,0,0,0,0,0,620.56960000000015,"Proof"]
[null,"2019-09-21","Waste Processing Services",344.90730000000008,null,null,null,null,344.90730000000008,3,0,0,344.90730000000008,0,0,0,0,0,0,0,0,0,0,344.90730000000008,"Proof"]
[null,"2019-09-03","Comcast",null,542.35,null,null,null,542.35,1,542.35,0,0,0,0,0,0,0,0,0,0,0,0,542.35,"Proof"]
[null,"2019-08-19","Direct IT Services",null,2154.65,null,null,null,2154.65,1,2154.65,0,0,0,0,0,0,0,0,0,0,0,0,2154.65,"Proof"]
[null,"2019-09-01","East Point Storage",null,125,null,null,null,125,1,125,0,0,0,0,0,0,0,0,0,0,0,0,125,"Proof"]
[null,"2019-08-30","Lab Services",null,150,null,null,null,150,1,150,0,0,0,0,0,0,0,0,0,0,0,0,150,"Proof"]
[null,"2019-09-03","Lab Services",null,25,null,null,null,25,1,25,0,0,0,0,0,0,0,0,0,0,0,0,25,"Proof"]
[null,"2019-08-16","Safe Way",null,7254.95,null,null,null,7254.95,1,7254.95,0,0,0,0,0,0,0,0,0,0,0,0,7254.95,"Proof"]
[null,"2019-09-01","Healthcare Services",null,18965.25,null,null,null,18965.25,1,18965.25,0,0,0,0,0,0,0,0,0,0,0,0,18965.25,"Proof"]
[null,"2019-08-09","Yellow Services",null,85,null,null,null,85,1,85,0,0,0,0,0,0,0,0,0,0,0,0,85,"Proof"]
[null,"2019-08-09","Yellow Services",null,265.45,null,null,null,265.45,1,265.45,0,0,0,0,0,0,0,0,0,0,0,0,265.45,"Proof"]
[null,"2019-07-19","Johnson Cleaners",null,null,125.35,null,null,125.35,1,125.35,0,0,0,0,0,0,0,0,0,0,0,0,125.35,"Proof"]
[null,"2019-07-01","Supply House, LLC",null,null,null,1211.58,null,1211.58,1,1211.58,0,0,0,0,0,0,0,0,0,0,0,0,1211.58,"Proof"]
[null,"2018-12-11","Davis Burch, LLC",null,null,null,null,50,50,1,50,0,0,0,0,0,0,0,0,0,0,0,0,50,"Proof"]
[null,null,"Dell",null,null,null,null,-575,-575,1,-575,0,0,0,0,0,0,0,0,0,0,0,0,-575,"Proof"]
[null,"2019-04-15","Progressive",null,null,null,null,258,258,1,258,0,0,0,0,0,0,0,0,0,0,0,0,258,"Proof"]
[null,null,null,null,null,null,null,null,0,1,0,0,0,0,0,0,0,0,{"$f":"IF($J52=VALUE(RIGHT(S$5,2)),$I52,0)","v":0},0,0,0,0,0,"Proof"]
[null,null,null,null,null,null,null,null,0,1,0,0,0,0,0,0,0,0,0,0,0,0,0,0,"Proof"]
[null,null,null,null,null,null,null,null,0,1,0,0,0,0,0,0,0,0,0,0,0,0,0,0,"Proof"]
[null,null,null,null,null,null,null,null,0,1,0,0,0,0,0,0,0,0,0,0,0,0,0,0,"Proof"]
[null,null,null,null,null,null,null,null,0,1,0,0,0,0,0,0,0,0,0,0,0,0,0,0,"Proof"]
[null,null,null,null,null,null,null,null,0,1,0,0,0,0,0,0,0,0,0,0,0,0,0,0,"Proof"]
[null,null,null,null,null,null,null,null,0,1,0,0,0,0,0,0,0,0,0,0,0,0,0,0,"Proof"]
[null,null,null,null,null,null,null,null,0,1,0,0,0,0,0,0,0,0,0,0,0,0,0,0,"Proof"]
[null,null,null,null,null,null,null,null,{"$f":"SUM(D60:H60)","v":0},1,0,0,0,0,0,0,0,0,0,0,0,0,0,0,"Proof"]
[null,null,null,null,null,null,null,null,0,1,0,0,0,0,0,0,0,0,0,0,0,0,0,0,"Proof"]
[null,null,null,null,null,null,null,null,0,1,0,0,0,0,0,0,0,0,0,0,0,0,0,0,"Proof"]
[null,null,null,null,null,null,null,null,0,1,0,0,0,0,0,0,0,0,0,0,0,0,0,0,"Proof"]
[null,null,null,null,null,null,null,null,0,1,0,0,0,0,0,0,0,0,0,0,0,0,0,0,"Proof"]
[null,null,null,null,null,null,null,null,0,1,0,0,0,0,0,0,0,0,0,0,0,0,0,0,"Proof"]
[null,null,null,null,null,null,null,null,0,1,0,0,0,0,0,0,0,0,0,0,0,0,0,0,"Proof"]
[null,null,null,null,null,null,null,null,0,1,0,0,0,0,0,0,0,0,0,0,0,0,0,0,"Proof"]
[null,null,null,null,null,null,null,null,0,1,0,0,0,0,0,0,0,0,0,0,0,0,0,0,"Proof"]
[null,null,null,null,null,null,null,null,0,1,0,0,0,0,0,0,0,0,0,0,0,0,0,0,"Proof"]
[null,null,null,null,null,null,null,null,0,1,{"$f":"IF($J70=VALUE(RIGHT(K$5,2)),$I70,0)","v":0},0,0,0,0,0,0,0,0,0,0,0,0,0,"Proof"]
[null,null,null,null,null,null,null,null,{"$f":"SUM(D71:H71)","v":0},1,0,0,0,0,0,0,0,0,0,0,0,0,0,{"$f":"SUM(K71:W71)","v":0},{"$f":"IF(X71=I71,\"Proof\",\"Error\")","v":"Proof"}]
[null,null,null,null,null,null,null,null,0,1,0,0,0,0,0,0,0,0,0,0,0,0,0,0,"Proof"]
[null,null,null,null,null,null,null,null,0,1,0,0,0,0,0,0,0,0,0,0,0,0,0,0,"Proof"]
[null,null,null,null,null,null,null,null,0,{"$f":"IF(B74<=K$6,1,ROUNDUP(((B74-K$6)/7),0))","v":1},0,0,0,0,0,0,0,0,0,0,0,0,0,0,"Proof"]
[null,null,null,null,null,null,null,null,0,1,0,0,0,0,0,0,0,0,0,0,0,0,0,0,"Proof"]
[null,null,null,null,null,null,null,null,0,1,0,0,0,0,0,0,0,0,0,0,0,0,0,0,"Proof"]
[null,null,null,null,null,null,null,null,0,1,0,0,0,0,0,0,0,0,0,0,0,0,0,0,"Proof"]
[null,null,null,null,null,null,null,null,0,1,0,0,0,0,0,0,0,0,0,0,0,0,0,0,"Proof"]
[null,null,null,null,null,null,null,null,0,1,0,0,0,0,0,0,0,0,0,0,0,0,0,0,"Proof"]
[null,null,null,null,null,null,null,null,0,1,0,0,0,0,0,0,0,0,0,0,0,0,0,0,"Proof"]
[null,null,null,null,null,null,null,null,0,1,0,0,0,0,0,0,0,0,0,0,0,0,0,0,"Proof"]
[null,null,null,null,null,null,null,null,0,1,0,0,0,0,0,0,0,0,0,0,0,0,0,0,"Proof"]
[null,null,null,null,null,null,null,null,0,1,0,0,0,0,0,0,0,0,0,0,0,0,0,0,"Proof"]
[null,null,null,null,null,null,null,null,0,1,0,0,0,0,0,0,0,0,0,0,0,0,0,0,"Proof"]
[null,null,null,null,null,null,null,null,0,1,0,0,0,0,0,0,0,0,0,0,0,0,0,0,"Proof"]
[null,null,null,null,null,null,null,null,0,null,0,0,0,0,0,0,0,0,0,0,0,{"$f":"IF($J86=VALUE(RIGHT(V$5,2)),$I86,0)","v":0},0,0,"Proof"]
[null,null,null,null,null,null,null,null,0,null,0,0,0,0,0,0,0,0,0,0,0,0,0,0,"Proof"]
[null,null,null,null,null,null,null,null,0,null,0,0,0,0,0,0,0,0,0,0,0,0,0,0,"Proof"]
[null,null,null,null,null,null,null,null,0,null,0,0,0,0,0,0,0,0,0,0,0,0,0,0,"Proof"]
[null,null,null,null,null,null,null,null,0,null,0,0,0,0,0,0,0,0,0,0,0,0,0,0,"Proof"]
[null,null,null,null,null,null,null,null,0,null,0,0,0,0,0,0,0,0,0,0,0,0,0,0,"Proof"]
[null,null,null,null,null,null,null,null,0,null,0,0,0,0,0,0,0,0,0,0,0,0,0,0,"Proof"]
[null,null,null,null,null,null,null,null,0,null,0,0,0,0,0,0,0,0,0,0,0,0,0,0,"Proof"]
[null,null,null,null,null,null,null,null,0,null,0,0,0,0,0,0,0,0,0,0,0,0,0,0,"Proof"]
[null,null,null,null,null,null,null,null,0,null,0,0,0,0,0,0,0,0,0,0,0,0,0,0,"Proof"]
[null,null,null,null,null,null,null,null,0,null,0,0,0,0,0,0,0,0,0,0,0,0,0,0,"Proof"]
[null,null,null,null,null,null,null,null,0,null,0,0,0,0,0,0,0,0,0,0,0,0,0,0,"Proof"]
[null,null,null,null,null,null,null,null,0,null,0,0,0,0,0,0,0,0,0,0,0,0,0,0,"Proof"]
[null,null,null,null,null,null,null,null,0,null,0,0,0,0,0,0,0,0,0,0,0,0,0,0,"Proof"]
[null,null,null,null,null,null,null,null,0,null,0,0,0,0,0,0,0,0,0,0,0,0,0,0,"Proof"]
[null,null,null,null,null,null,null,null,0,null,0,0,0,0,0,0,0,0,0,0,0,0,0,0,"Proof"]
[null,null,null,null,null,null,null,null,0,null,0,0,0,0,0,0,0,0,0,0,0,0,0,0,"Proof"]
[null,null,null,null,null,null,null,null,0,null,0,0,0,0,0,0,0,0,0,0,0,0,0,0,"Proof"]
[null,null,null,null,null,null,null,null,0,null,0,0,0,0,0,0,0,0,0,0,0,0,0,0,"Proof"]
[null,null,null,null,null,null,null,null,0,null,0,0,0,0,0,0,0,0,0,0,0,0,0,0,"Proof"]
[null,null,null,null,null,null,null,null,0,null,0,0,0,0,0,0,{"$f":"IF($J106=VALUE(RIGHT(Q$5,2)),$I106,0)","v":0},0,0,0,0,0,0,0,"Proof"]
[null,null,null,null,null,null,null,null,0,null,0,0,0,0,0,0,0,0,0,0,0,0,0,0,"Proof"]
[null,null,null,null,null,null,null,null,0,null,0,0,0,0,0,0,0,0,0,0,0,0,0,0,"Proof"]
[null,null,null,null,null,null,null,null,0,null,0,0,0,0,0,0,0,0,0,0,0,0,0,0,"Proof"]
[null,null,null,null,null,null,null,null,0,null,0,0,0,0,0,0,0,0,0,0,0,0,0,0,"Proof"]
[null,null,null,null,null,null,null,null,0,null,0,0,0,0,0,0,0,0,0,0,0,0,0,0,"Proof"]
[null,null,null,null,null,null,null,null,0,null,0,0,0,0,0,0,0,0,0,0,0,0,0,0,"Proof"]
[null,null,null,null,null,null,null,null,0,null,0,0,0,0,0,0,0,0,0,0,0,0,0,0,"Proof"]
[null,null,null,null,null,null,null,null,0,null,0,0,0,0,0,0,0,0,0,0,0,0,0,0,"Proof"]
[null,null,null,null,null,null,null,null,0,null,0,0,0,0,0,0,0,0,0,0,0,0,0,0,"Proof"]
[null,null,null,null,null,null,null,null,0,null,0,0,0,0,0,0,0,0,0,0,0,0,0,0,"Proof"]
[null,null,null,null,null,null,null,null,0,null,0,0,0,0,0,0,0,0,0,0,0,0,0,0,"Proof"]
[null,null,null,null,null,null,null,null,0,null,0,0,0,0,0,0,0,0,0,0,0,0,0,0,"Proof"]
[null,null,null,null,null,null,null,null,0,null,0,0,0,0,0,0,0,0,0,0,0,0,0,0,"Proof"]
[null,null,null,null,null,null,null,null,0,null,0,0,0,0,0,0,0,0,0,0,0,0,0,0,"Proof"]
[null,null,null,null,null,null,null,null,0,null,0,0,0,0,0,0,0,0,0,0,0,0,0,0,"Proof"]
[null,null,null,null,null,null,null,null,0,null,0,0,0,0,0,0,0,0,0,0,0,0,0,0,"Proof"]
[null,null,null,null,null,null,null,null,0,null,0,0,0,0,0,0,0,0,0,0,0,0,0,0,"Proof"]
[null,null,null,null,null,null,null,null,0,null,0,0,0,0,0,0,0,0,0,0,0,0,0,0,"Proof"]
[null,null,null,null,null,null,null,null,0,null,0,0,0,0,0,0,0,0,0,0,0,0,0,0,"Proof"]
[null,null,null,null,null,null,null,null,0,null,0,{"$f":"IF($J126=VALUE(RIGHT(L$5,2)),$I126,0)","v":0},0,0,0,0,0,0,0,0,0,0,0,0,"Proof"]
[null,null,null,null,null,null,null,null,0,null,0,0,0,0,0,0,0,0,0,0,0,0,0,0,"Proof"]
[null,null,null,null,null,null,null,null,0,null,0,0,0,0,0,0,0,0,0,0,0,0,0,0,"Proof"]
[null,null,null,null,null,null,null,null,0,null,0,0,0,0,0,0,0,0,0,0,0,0,0,0,"Proof"]
[null,null,null,null,null,null,null,null,0,null,0,0,0,0,0,0,0,0,0,0,0,0,0,0,"Proof"]
[null,null,null,null,null,null,null,null,0,null,0,0,0,0,0,0,0,0,0,0,0,0,0,0,"Proof"]
[null,null,null,null,null,null,null,null,0,null,0,0,0,0,0,0,0,0,0,0,0,0,0,0,"Proof"]
[null,null,null,null,null,null,null,null,{"$f":"SUM(D133:H133)","v":0},null,0,0,0,0,0,0,0,0,0,0,0,0,0,{"$f":"SUM(K133:W133)","v":0},{"$f":"IF(X133=I133,\"Proof\",\"Error\")","v":"Proof"}]
[null,null,null,null,null,null,null,null,0,null,0,0,0,0,0,0,0,0,0,0,0,0,0,0,"Proof"]
[null,null,null,null,null,null,null,null,0,null,0,0,0,0,0,0,0,0,0,0,0,0,0,0,"Proof"]
[null,null,null,null,null,null,null,null,0,null,0,0,0,0,0,0,0,0,0,0,0,0,0,0,"Proof"]
[null,null,null,null,null,null,null,null,0,null,0,0,0,0,0,0,0,0,0,0,0,0,0,0,"Proof"]
[null,null,null,null,null,null,null,null,0,null,0,0,0,0,0,0,0,0,0,0,0,0,0,0,"Proof"]
[null,null,null,null,null,null,null,null,0,null,0,0,0,0,0,0,0,0,0,0,0,0,0,0,"Proof"]
[null,null,null,null,null,null,null,null,0,null,0,0,0,0,0,0,0,0,0,0,0,0,0,0,"Proof"]
[null,null,null,null,null,null,null,null,0,null,0,0,0,0,0,0,0,0,0,0,0,0,0,0,"Proof"]
[null,null,null,null,null,null,null,null,0,null,0,0,0,0,0,0,0,0,0,0,0,0,0,0,"Proof"]
[null,null,null,null,null,null,null,null,0,null,0,0,0,0,0,0,0,0,0,0,0,0,0,0,"Proof"]
[null,null,null,null,null,null,null,null,0,null,0,0,0,0,0,0,0,0,0,0,0,0,0,0,"Proof"]
[null,null,null,null,null,null,null,null,0,null,0,0,0,0,0,0,0,0,0,{"$f":"IF($J145=VALUE(RIGHT(T$5,2)),$I145,0)","v":0},0,0,0,0,"Proof"]
[null,null,null,null,null,null,null,null,0,null,0,0,0,0,0,0,0,0,0,0,0,0,0,0,"Proof"]
[null,null,null,null,null,null,null,null,0,null,0,0,0,0,0,0,0,0,0,0,0,0,0,0,"Proof"]
[null,null,null,null,null,null,null,null,0,null,0,0,0,0,0,0,0,0,0,0,0,0,0,0,"Proof"]
[null,null,null,null,null,null,null,null,0,null,0,0,0,0,0,0,0,0,0,0,0,0,0,0,"Proof"]
[null,null,null,null,null,null,null,null,0,null,0,0,0,0,0,0,0,0,0,0,0,0,0,0,"Proof"]
[null,null,null,null,null,null,null,null,0,null,0,0,0,0,0,0,0,0,0,0,0,0,0,0,"Proof"]
[null,null,null,null,null,null,null,null,0,null,0,0,0,0,0,0,0,0,0,0,0,0,0,0,"Proof"]
[null,null,null,null,null,null,null,null,0,null,0,0,0,0,0,0,0,0,0,0,0,0,0,0,"Proof"]
[null,null,null,null,null,null,null,null,0,null,0,0,0,0,0,0,0,0,0,0,0,0,0,0,"Proof"]
[null,null,null,null,null,null,null,null,0,null,0,0,0,0,0,0,0,0,0,0,0,0,0,0,"Proof"]
[null,null,null,null,null,null,null,null,0,null,0,0,0,0,0,0,0,0,0,0,0,0,0,0,"Proof"]
[null,null,null,null,null,null,null,null,0,null,0,0,0,0,0,0,0,0,0,0,0,0,0,0,"Proof"]
[null,null,null,null,null,null,null,null,0,null,0,0,0,0,0,0,0,0,0,0,0,0,0,0,"Proof"]
[null,null,null,null,null,null,null,null,0,null,0,0,0,0,0,0,0,0,0,0,0,0,0,0,"Proof"]
[null,null,null,null,null,null,null,null,0,null,0,0,0,0,0,0,0,0,0,0,0,0,0,0,"Proof"]
[null,null,null,null,null,null,null,null,0,null,0,0,0,0,0,0,0,0,0,0,0,0,0,0,"Proof"]
[null,null,null,null,null,null,null,null,0,null,0,0,0,0,0,0,0,0,0,0,0,0,0,0,"Proof"]
[null,null,null,null,null,null,null,null,0,null,0,0,0,0,0,0,0,0,0,0,0,0,0,0,"Proof"]
[null,null,null,null,null,null,null,null,0,null,0,0,0,0,0,0,0,0,0,0,0,0,0,0,"Proof"]
[null,null,null,null,null,null,null,null,0,null,0,0,0,0,{"$f":"IF($J165=VALUE(RIGHT(O$5,2)),$I165,0)","v":0},0,0,0,0,0,0,0,0,0,"Proof"]
[null,null,null,null,null,null,null,null,0,null,0,0,0,0,0,0,0,0,0,0,0,0,0,0,"Proof"]
[null,null,null,null,null,null,null,null,0,null,0,0,0,0,0,0,0,0,0,0,0,0,0,0,"Proof"]
[null,null,null,null,null,null,null,null,0,null,0,0,0,0,0,0,0,0,0,0,0,0,0,0,"Proof"]
[null,null,null,null,null,null,null,null,0,null,0,0,0,0,0,0,0,0,0,0,0,0,0,0,"Proof"]
[null,null,null,null,null,null,null,null,0,null,0,0,0,0,0,0,0,0,0,0,0,0,0,0,"Proof"]
[null,null,null,null,null,null,null,null,0,null,0,0,0,0,0,0,0,0,0,0,0,0,0,0,"Proof"]
[null,null,null,null,null,null,null,null,0,null,0,0,0,0,0,0,0,0,0,0,0,0,0,0,"Proof"]
[null,null,null,null,null,null,null,null,0,null,0,0,0,0,0,0,0,0,0,0,0,0,0,0,"Proof"]
[null,null,null,null,null,null,null,null,0,null,0,0,0,0,0,0,0,0,0,0,0,0,0,0,"Proof"]
[null,null,null,null,null,null,null,null,0,null,0,0,0,0,0,0,0,0,0,0,0,0,0,0,"Proof"]
[null,null,null,null,null,null,null,null,0,null,0,0,0,0,0,0,0,0,0,0,0,0,0,0,"Proof"]
[null,null,null,null,null,null,null,null,0,null,0,0,0,0,0,0,0,0,0,0,0,0,0,0,"Proof"]
[null,null,null,null,null,null,null,null,0,null,0,0,0,0,0,0,0,0,0,0,0,0,0,0,"Proof"]
[null,null,null,null,null,null,null,null,0,null,0,0,0,0,0,0,0,0,0,0,0,0,0,0,"Proof"]
[null,null,null,null,null,null,null,null,0,null,0,0,0,0,0,0,0,0,0,0,0,0,0,0,"Proof"]
[null,null,null,null,null,null,null,null,0,null,0,0,0,0,0,0,0,0,0,0,0,0,0,0,"Proof"]
[null,null,null,null,null,null,null,null,0,null,0,0,0,0,0,0,0,0,0,0,0,0,0,0,"Proof"]
[null,null,null,null,null,null,null,null,0,null,0,0,0,0,0,0,0,0,0,0,0,0,0,0,"Proof"]
[null,null,null,null,null,null,null,null,0,null,0,0,0,0,0,0,0,0,0,0,0,0,{"$f":"IF($J184=VALUE(RIGHT(W$5,2)),$I184,0)","v":0},0,"Proof"]
[null,null,null,null,null,null,null,null,0,null,0,0,0,0,0,0,0,0,0,0,0,0,0,0,"Proof"]
[null,null,null,null,null,null,null,null,0,null,0,0,0,0,0,0,0,0,0,0,0,0,0,0,"Proof"]
[null,null,null,null,null,null,null,null,0,null,0,0,0,0,0,0,0,0,0,0,0,0,0,0,"Proof"]
[null,null,null,null,null,null,null,null,0,null,0,0,0,0,0,0,0,0,0,0,0,0,0,0,"Proof"]
[null,null,null,null,null,null,null,null,0,null,0,0,0,0,0,0,0,0,0,0,0,0,0,0,"Proof"]
[null,null,null,null,null,null,null,null,0,null,0,0,0,0,0,0,0,0,0,0,0,0,0,0,"Proof"]
[null,null,null,null,null,null,null,null,0,null,0,0,0,0,0,0,0,0,0,0,0,0,0,0,"Proof"]
[null,null,null,null,null,null,null,null,0,null,0,0,0,0,0,0,0,0,0,0,0,0,0,0,"Proof"]
[null,null,null,null,null,null,null,null,0,null,0,0,0,0,0,0,0,0,0,0,0,0,0,0,"Proof"]
[null,null,null,null,null,null,null,null,0,null,0,0,0,0,0,0,0,0,0,0,0,0,0,0,"Proof"]
[null,null,null,null,null,null,null,null,0,null,0,0,0,0,0,0,0,0,0,0,0,0,0,0,"Proof"]
[null,null,null,null,null,null,null,null,0,null,0,0,0,0,0,0,0,0,0,0,0,0,0,0,"Proof"]
[null,null,null,null,null,null,null,null,{"$f":"SUM(D197:H197)","v":0},null,0,0,0,0,0,0,0,0,0,0,0,0,0,{"$f":"SUM(K197:W197)","v":0},{"$f":"IF(X197=I197,\"Proof\",\"Error\")","v":"Proof"}]
[null,null,null,null,null,null,null,null,0,null,0,0,0,0,0,0,0,0,0,0,0,0,0,0,"Proof"]
[null,null,null,null,null,null,null,null,0,null,0,0,0,0,0,0,0,0,0,0,0,0,0,0,"Proof"]
[null,null,null,null,null,null,null,null,0,null,0,0,0,0,0,0,0,0,0,0,0,0,0,0,"Proof"]
[null,null,null,null,null,null,null,null,0,null,0,0,0,0,0,0,0,0,0,0,0,0,0,0,"Proof"]
[null,null,null,null,null,null,null,null,0,null,0,0,0,0,0,0,0,0,0,0,0,0,0,0,"Proof"]
[null,null,null,null,null,null,null,null,0,null,0,0,0,0,0,0,0,0,0,0,0,0,0,0,"Proof"]
[null,null,null,null,null,null,null,null,0,null,0,0,0,0,0,0,0,{"$f":"IF($J204=VALUE(RIGHT(R$5,2)),$I204,0)","v":0},0,0,0,0,0,0,"Proof"]
[null,null,null,null,null,null,null,null,0,null,0,0,0,0,0,0,0,0,0,0,0,0,0,0,"Proof"]
[null,null,null,null,null,null,null,null,0,null,0,0,0,0,0,0,0,0,0,0,0,0,0,0,"Proof"]
[null,null,null,null,null,null,null,null,0,null,0,0,0,0,0,0,0,0,0,0,0,0,0,0,"Proof"]
[null,null,null,null,null,null,null,null,0,null,0,0,0,0,0,0,0,0,0,0,0,0,0,0,"Proof"]
[null,null,null,null,null,null,null,null,0,null,0,0,0,0,0,0,0,0,0,0,0,0,0,0,"Proof"]
[null,null,null,null,null,null,null,null,0,null,0,0,0,0,0,0,0,0,0,0,0,0,0,0,"Proof"]
[null,null,null,null,null,null,null,null,0,null,0,0,0,0,0,0,0,0,0,0,0,0,0,0,"Proof"]
[null,null,null,null,null,null,null,null,0,null,0,0,0,0,0,0,0,0,0,0,0,0,0,0,"Proof"]
[null,null,null,null,null,null,null,null,0,null,0,0,0,0,0,0,0,0,0,0,0,0,0,0,"Proof"]
[null,null,null,null,null,null,null,null,0,null,0,0,0,0,0,0,0,0,0,0,0,0,0,0,"Proof"]
[null,null,null,null,null,null,null,null,0,null,0,0,0,0,0,0,0,0,0,0,0,0,0,0,"Proof"]
[null,null,null,null,null,null,null,null,0,null,0,0,0,0,0,0,0,0,0,0,0,0,0,0,"Proof"]
[null,null,null,null,null,null,null,null,0,null,0,0,0,0,0,0,0,0,0,0,0,0,0,0,"Proof"]
[null,null,null,null,null,null,null,null,0,null,0,0,0,0,0,0,0,0,0,0,0,0,0,0,"Proof"]
[null,null,null,null,null,null,null,null,0,null,0,0,0,0,0,0,0,0,0,0,0,0,0,0,"Proof"]
[null,null,null,null,null,null,null,null,0,null,0,0,0,0,0,0,0,0,0,0,0,0,0,0,"Proof"]
[null,null,null,null,null,null,null,null,0,null,0,0,0,0,0,0,0,0,0,0,0,0,0,0,"Proof"]
[null,null,null,null,null,null,null,null,0,null,0,0,0,0,0,0,0,0,0,0,0,0,0,0,"Proof"]
[null,null,null,null,null,null,null,null,0,null,0,0,0,0,0,0,0,0,0,0,0,0,0,0,"Proof"]
[null,null,null,null,null,null,null,null,0,null,0,0,{"$f":"IF($J224=VALUE(RIGHT(M$5,2)),$I224,0)","v":0},0,0,0,0,0,0,0,0,0,0,0,"Proof"]
[null,null,null,null,null,null,null,null,0,null,0,0,0,0,0,0,0,0,0,0,0,0,0,0,"Proof"]
[null,null,null,null,null,null,null,null,0,null,0,0,0,0,0,0,0,0,0,0,0,0,0,0,"Proof"]
[null,null,null,null,null,null,null,null,0,null,0,0,0,0,0,0,0,0,0,0,0,0,0,0,"Proof"]
[null,null,null,null,null,null,null,null,0,null,0,0,0,0,0,0,0,0,0,0,0,0,0,0,"Proof"]
[null,null,null,null,null,null,null,null,0,null,0,0,0,0,0,0,0,0,0,0,0,0,0,0,"Proof"]
[null,null,null,null,null,null,null,null,0,null,0,0,0,0,0,0,0,0,0,0,0,0,0,0,"Proof"]
[null,null,null,null,null,null,null,null,0,null,0,0,0,0,0,0,0,0,0,0,0,0,0,0,"Proof"]
[null,null,null,null,null,null,null,null,0,null,0,0,0,0,0,0,0,0,0,0,0,0,0,0,"Proof"]
[null,null,null,null,null,null,null,null,0,null,0,0,0,0,0,0,0,0,0,0,0,0,0,0,"Proof"]
[null,null,null,null,null,null,null,null,0,null,0,0,0,0,0,0,0,0,0,0,0,0,0,0,"Proof"]
[null,null,null,null,null,null,null,null,0,null,0,0,0,0,0,0,0,0,0,0,0,0,0,0,"Proof"]
[null,null,null,null,null,null,null,null,0,null,0,0,0,0,0,0,0,0,0,0,0,0,0,0,"Proof"]
[null,null,null,null,null,null,null,null,0,null,0,0,0,0,0,0,0,0,0,0,0,0,0,0,"Proof"]
[null,null,null,null,null,null,null,null,0,null,0,0,0,0,0,0,0,0,0,0,0,0,0,0,"Proof"]
[null,null,null,null,null,null,null,null,0,null,0,0,0,0,0,0,0,0,0,0,0,0,0,0,"Proof"]
[null,null,null,null,null,null,null,null,0,null,0,0,0,0,0,0,0,0,0,0,0,0,0,0,"Proof"]
[null,null,null,null,null,null,null,null,0,null,0,0,0,0,0,0,0,0,0,0,0,0,0,0,"Proof"]
[null,null,null,null,null,null,null,null,0,null,0,0,0,0,0,0,0,0,0,0,0,0,0,0,"Proof"]
[null,null,null,null,null,null,null,null,0,null,0,0,0,0,0,0,0,0,0,0,{"$f":"IF($J243=VALUE(RIGHT(U$5,2)),$I243,0)","v":0},0,0,0,"Proof"]
[null,null,null,null,null,null,null,null,0,null,0,0,0,0,0,0,0,0,0,0,0,0,0,0,"Proof"]
[null,null,null,null,null,null,null,null,0,null,0,0,0,0,0,0,0,0,0,0,0,0,0,0,"Proof"]
[null,null,null,null,null,null,null,null,0,null,0,0,0,0,0,0,0,0,0,0,0,0,0,0,"Proof"]
[null,null,null,null,null,null,null,null,0,null,0,0,0,0,0,0,0,0,0,0,0,0,0,0,"Proof"]
[null,null,null,null,null,null,null,null,0,null,0,0,0,0,0,0,0,0,0,0,0,0,0,0,"Proof"]
[null,null,null,null,null,null,null,null,0,null,0,0,0,0,0,0,0,0,0,0,0,0,0,0,"Proof"]
[null,null,null,null,null,null,null,null,0,null,0,0,0,0,0,0,0,0,0,0,0,0,0,0,"Proof"]
[null,null,null,null,null,null,null,null,0,null,0,0,0,0,0,0,0,0,0,0,0,0,0,0,"Proof"]
[null,null,null,null,null,null,null,null,0,null,0,0,0,0,0,0,0,0,0,0,0,0,0,0,"Proof"]
[null,null,null,null,null,null,null,null,0,null,0,0,0,0,0,0,0,0,0,0,0,0,0,0,"Proof"]
[null,null,null,null,null,null,null,null,0,null,0,0,0,0,0,0,0,0,0,0,0,0,0,0,"Proof"]
[null,null,null,null,null,null,null,null,0,null,0,0,0,0,0,0,0,0,0,0,0,0,0,0,"Proof"]
[null,null,null,null,null,null,null,null,0,null,0,0,0,0,0,0,0,0,0,0,0,0,0,0,"Proof"]
[null,null,null,null,null,null,null,null,0,null,0,0,0,0,0,0,0,0,0,0,0,0,0,0,"Proof"]
[null,null,null,null,null,null,null,null,0,null,0,0,0,0,0,0,0,0,0,0,0,0,0,0,"Proof"]
[null,null,null,null,null,null,null,null,0,null,0,0,0,0,0,0,0,0,0,0,0,0,0,0,"Proof"]
[null,null,null,null,null,null,null,null,0,null,0,0,0,0,0,0,0,0,0,0,0,0,0,0,"Proof"]
[null,null,null,null,null,null,null,null,{"$f":"SUM(D261:H261)","v":0},null,0,0,0,0,0,0,0,0,0,0,0,0,0,{"$f":"SUM(K261:W261)","v":0},{"$f":"IF(X261=I261,\"Proof\",\"Error\")","v":"Proof"}]
[null,null,null,null,null,null,null,null,0,null,0,0,0,0,0,0,0,0,0,0,0,0,0,0,"Proof"]
[null,null,null,null,null,null,null,null,0,null,0,0,0,0,0,{"$f":"IF($J263=VALUE(RIGHT(P$5,2)),$I263,0)","v":0},0,0,0,0,0,0,0,0,"Proof"]
[null,null,null,null,null,null,null,null,0,null,0,0,0,0,0,0,0,0,0,0,0,0,0,0,"Proof"]
[null,null,null,null,null,null,null,null,0,null,0,0,0,0,0,0,0,0,0,0,0,0,0,0,"Proof"]
[null,null,null,null,null,null,null,null,0,null,0,0,0,0,0,0,0,0,0,0,0,0,0,0,"Proof"]
[null,null,null,null,null,null,null,null,0,null,0,0,0,0,0,0,0,0,0,0,0,0,0,0,"Proof"]
[null,null,null,null,null,null,null,null,0,null,0,0,0,0,0,0,0,0,0,0,0,0,0,0,"Proof"]
[null,null,null,null,null,null,null,null,0,null,0,0,0,0,0,0,0,0,0,0,0,0,0,0,"Proof"]
[null,null,null,null,null,null,null,null,0,null,0,0,0,0,0,0,0,0,0,0,0,0,0,0,"Proof"]
[null,null,null,null,null,null,null,null,0,null,0,0,0,0,0,0,0,0,0,0,0,0,0,0,"Proof"]
[null,null,null,null,null,null,null,null,0,null,0,0,0,0,0,0,0,0,0,0,0,0,0,0,"Proof"]
[null,null,null,null,null,null,null,null,0,null,0,0,0,0,0,0,0,0,0,0,0,0,0,0,"Proof"]
[null,null,null,null,null,null,null,null,0,null,0,0,0,0,0,0,0,0,0,0,0,0,0,0,"Proof"]
[null,null,null,null,null,null,null,null,0,null,0,0,0,0,0,0,0,0,0,0,0,0,0,0,"Proof"]
[null,null,null,null,null,null,null,null,0,null,0,0,0,0,0,0,0,0,0,0,0,0,0,0,"Proof"]
[null,null,null,null,null,null,null,null,0,null,0,0,0,0,0,0,0,0,0,0,0,0,0,0,"Proof"]
[null,null,null,null,null,null,null,null,0,null,0,0,0,0,0,0,0,0,0,0,0,0,0,0,"Proof"]
[null,null,null,null,null,null,null,null,0,null,0,0,0,0,0,0,0,0,0,0,0,0,0,0,"Proof"]
[null,null,null,null,null,null,null,null,0,null,0,0,0,0,0,0,0,0,0,0,0,0,0,0,"Proof"]
[null,null,null,null,null,null,null,null,0,null,0,0,0,0,0,0,0,0,0,0,0,0,0,0,"Proof"]
[null,null,null,null,null,null,null,null,0,null,0,0,0,0,0,0,0,0,0,0,0,0,0,0,"Proof"]
[null,null,null,null,null,null,null,null,0,null,{"$f":"IF($J283=VALUE(RIGHT(K$5,2)),$I283,0)","v":0},0,0,0,0,0,0,0,0,0,0,0,0,0,"Proof"]
[null,null,null,null,null,null,null,null,0,null,0,0,0,0,0,0,0,0,0,0,0,0,0,0,"Proof"]
[null,null,null,null,null,null,null,null,0,null,0,0,0,0,0,0,0,0,0,0,0,0,0,0,"Proof"]
[null,null,null,null,null,null,null,null,0,null,0,0,0,0,0,0,0,0,0,0,0,0,0,0,"Proof"]
[null,null,null,null,null,null,null,null,0,null,0,0,0,0,0,0,0,0,0,0,0,0,0,0,"Proof"]
[null,null,null,null,null,null,null,null,0,null,0,0,0,0,0,0,0,0,0,0,0,0,0,0,"Proof"]
[null,null,null,null,null,null,null,null,0,null,0,0,0,0,0,0,0,0,0,0,0,0,0,0,"Proof"]
[null,null,null,null,null,null,null,null,0,null,0,0,0,0,0,0,0,0,0,0,0,0,0,0,"Proof"]
[null,null,null,null,null,null,null,null,0,null,0,0,0,0,0,0,0,0,0,0,0,0,0,0,"Proof"]
[null,null,null,null,null,null,null,null,0,null,0,0,0,0,0,0,0,0,0,0,0,0,0,0,"Proof"]
[null,null,null,null,null,null,null,null,0,null,0,0,0,0,0,0,0,0,0,0,0,0,0,0,"Proof"]
[null,null,null,null,null,null,null,null,0,null,0,0,0,0,0,0,0,0,0,0,0,0,0,0,"Proof"]
[null,null,null,null,null,null,null,null,0,null,0,0,0,0,0,0,0,0,0,0,0,0,0,0,"Proof"]
[null,null,null,null,null,null,null,null,0,null,0,0,0,0,0,0,0,0,0,0,0,0,0,0,"Proof"]
[null,null,null,null,null,null,null,null,0,null,0,0,0,0,0,0,0,0,0,0,0,0,0,0,"Proof"]
[null,null,null,null,null,null,null,null,0,null,0,0,0,0,0,0,0,0,0,0,0,0,0,0,"Proof"]
[null,null,null,null,null,null,null,null,0,null,0,0,0,0,0,0,0,0,0,0,0,0,0,0,"Proof"]
[null,null,null,null,null,null,null,null,0,null,0,0,0,0,0,0,0,0,0,0,0,0,0,0,"Proof"]
[null,null,null,null,null,null,null,null,0,null,0,0,0,0,0,0,0,0,0,0,0,0,0,0,"Proof"]
[null,null,null,null,null,null,null,null,0,null,0,0,0,0,0,0,0,0,{"$f":"IF($J302=VALUE(RIGHT(S$5,2)),$I302,0)","v":0},0,0,0,0,0,"Proof"]
[null,null,null,null,null,null,null,null,0,null,0,0,0,0,0,0,0,0,0,0,0,0,0,0,"Proof"]
[null,null,null,null,null,null,null,null,0,null,0,0,0,0,0,0,0,0,0,0,0,0,0,0,"Proof"]
[null,null,null,null,null,null,null,null,0,null,0,0,0,0,0,0,0,0,0,0,0,0,0,0,"Proof"]
[null,null,null,null,null,null,null,null,0,null,0,0,0,0,0,0,0,0,0,0,0,0,0,0,"Proof"]
[null,null,null,null,null,null,null,null,0,null,0,0,0,0,0,0,0,0,0,0,0,0,0,0,"Proof"]
[null,null,null,null,null,null,null,null,0,null,0,0,0,0,0,0,0,0,0,0,0,0,0,0,"Proof"]
[null,null,null,null,null,null,null,null,0,null,0,0,0,0,0,0,0,0,0,0,0,0,0,0,"Proof"]
[null,null,null,null,null,null,null,null,0,null,0,0,0,0,0,0,0,0,0,0,0,0,0,0,"Proof"]
[null,null,null,null,null,null,null,null,0,null,0,0,0,0,0,0,0,0,0,0,0,0,0,0,"Proof"]
[null,null,null,null,null,null,null,null,0,null,0,0,0,0,0,0,0,0,0,0,0,0,0,0,"Proof"]
[null,null,null,null,null,null,null,null,0,null,0,0,0,0,0,0,0,0,0,0,0,0,0,0,"Proof"]
[null,null,null,null,null,null,null,null,0,null,0,0,0,0,0,0,0,0,0,0,0,0,0,0,"Proof"]
[null,null,null,null,null,null,null,null,0,null,0,0,0,0,0,0,0,0,0,0,0,0,0,0,"Proof"]
[null,null,null,null,null,null,null,null,0,null,0,0,0,0,0,0,0,0,0,0,0,0,0,0,"Proof"]
[null,null,null,null,null,null,null,null,0,null,0,0,0,0,0,0,0,0,0,0,0,0,0,0,"Proof"]
[null,null,null,null,null,null,null,null,0,null,0,0,0,0,0,0,0,0,0,0,0,0,0,0,"Proof"]
[null,null,null,null,null,null,null,null,0,null,0,0,0,0,0,0,0,0,0,0,0,0,0,0,"Proof"]
[null,null,null,null,null,null,null,null,0,null,0,0,0,0,0,0,0,0,0,0,0,0,0,0,"Proof"]
[null,null,null,null,null,null,null,null,0,null,0,0,0,0,0,0,0,0,0,0,0,0,0,0,"Proof"]
[null,null,null,null,null,null,null,null,0,null,0,0,0,{"$f":"IF($J322=VALUE(RIGHT(N$5,2)),$I322,0)","v":0},0,0,0,0,0,0,0,0,0,0,"Proof"]
[null,null,null,null,null,null,null,null,0,null,0,0,0,0,0,0,0,0,0,0,0,0,0,0,"Proof"]
[null,null,null,null,null,null,null,null,0,null,0,0,0,0,0,0,0,0,0,0,0,0,0,0,"Proof"]
[null,null,null,null,null,null,null,null,{"$f":"SUM(D325:H325)","v":0},null,0,0,0,0,0,0,0,0,0,0,0,0,0,{"$f":"SUM(K325:W325)","v":0},{"$f":"IF(X325=I325,\"Proof\",\"Error\")","v":"Proof"}]
[null,null,null,null,null,null,null,null,0,null,0,0,0,0,0,0,0,0,0,0,0,0,0,0,"Proof"]
[null,null,null,null,null,null,null,null,0,null,0,0,0,0,0,0,0,0,0,0,0,0,0,0,"Proof"]
[null,null,null,null,null,null,null,null,0,null,0,0,0,0,0,0,0,0,0,0,0,0,0,0,"Proof"]
[null,null,null,null,null,null,null,null,0,null,0,0,0,0,0,0,0,0,0,0,0,0,0,0,"Proof"]
[null,null,null,null,null,null,null,null,0,null,0,0,0,0,0,0,0,0,0,0,0,0,0,0,"Proof"]
[null,null,null,null,null,null,null,null,0,null,0,0,0,0,0,0,0,0,0,0,0,0,0,0,"Proof"]
[null,null,null,null,null,null,null,null,0,null,0,0,0,0,0,0,0,0,0,0,0,0,0,0,"Proof"]
[null,null,null,null,null,null,null,null,0,null,0,0,0,0,0,0,0,0,0,0,0,0,0,0,"Proof"]
[null,null,null,null,null,null,null,null,0,null,0,0,0,0,0,0,0,0,0,0,0,0,0,0,"Proof"]
[null,null,null,null,null,null,null,null,0,null,0,0,0,0,0,0,0,0,0,0,0,0,0,0,"Proof"]
[null,null,null,null,null,null,null,null,0,null,0,0,0,0,0,0,0,0,0,0,0,0,0,0,"Proof"]
[null,null,null,null,null,null,null,null,0,null,0,0,0,0,0,0,0,0,0,0,0,0,0,0,"Proof"]
[null,null,null,null,null,null,null,null,0,null,0,0,0,0,0,0,0,0,0,0,0,0,0,0,"Proof"]
[null,null,null,null,null,null,null,null,0,null,0,0,0,0,0,0,0,0,0,0,0,0,0,0,"Proof"]
[null,null,null,null,null,null,null,null,0,null,0,0,0,0,0,0,0,0,0,0,0,0,0,0,"Proof"]
[null,null,null,null,null,null,null,null,0,null,0,0,0,0,0,0,0,0,0,0,0,{"$f":"IF($J341=VALUE(RIGHT(V$5,2)),$I341,0)","v":0},0,0,"Proof"]
[null,null,null,null,null,null,null,null,0,null,0,0,0,0,0,0,0,0,0,0,0,0,0,0,"Proof"]
[null,null,null,null,null,null,null,null,0,null,0,0,0,0,0,0,0,0,0,0,0,0,0,0,"Proof"]
[null,null,null,null,null,null,null,null,0,null,0,0,0,0,0,0,0,0,0,0,0,0,0,0,"Proof"]
[null,null,null,null,null,null,null,null,0,null,0,0,0,0,0,0,0,0,0,0,0,0,0,0,"Proof"]
[null,null,null,null,null,null,null,null,0,null,0,0,0,0,0,0,0,0,0,0,0,0,0,0,"Proof"]
[null,null,null,null,null,null,null,null,0,null,0,0,0,0,0,0,0,0,0,0,0,0,0,0,"Proof"]
[null,null,null,null,null,null,null,null,0,null,0,0,0,0,0,0,0,0,0,0,0,0,0,0,"Proof"]
[null,null,null,null,null,null,null,null,0,null,0,0,0,0,0,0,0,0,0,0,0,0,0,0,"Proof"]
[null,null,null,null,null,null,null,null,0,null,0,0,0,0,0,0,0,0,0,0,0,0,0,0,"Proof"]
[null,null,null,null,null,null,null,null,0,null,0,0,0,0,0,0,0,0,0,0,0,0,0,0,"Proof"]
[null,null,null,null,null,null,null,null,0,null,0,0,0,0,0,0,0,0,0,0,0,0,0,0,"Proof"]
[null,null,null,null,null,null,null,null,0,null,0,0,0,0,0,0,0,0,0,0,0,0,0,0,"Proof"]
[null,null,null,null,null,null,null,null,0,null,0,0,0,0,0,0,0,0,0,0,0,0,0,0,"Proof"]
[null,null,null,null,null,null,null,null,0,null,0,0,0,0,0,0,0,0,0,0,0,0,0,0,"Proof"]
[null,null,null,null,null,null,null,null,0,null,0,0,0,0,0,0,0,0,0,0,0,0,0,0,"Proof"]
[null,null,null,null,null,null,null,null,0,null,0,0,0,0,0,0,0,0,0,0,0,0,0,0,"Proof"]
[null,null,null,null,null,null,null,null,0,null,0,0,0,0,0,0,0,0,0,0,0,0,0,0,"Proof"]
[null,null,null,null,null,null,null,null,0,null,0,0,0,0,0,0,0,0,0,0,0,0,0,0,"Proof"]
[null,null,null,null,null,null,null,null,0,null,0,0,0,0,0,0,0,0,0,0,0,0,0,0,"Proof"]
[null,null,null,null,null,null,null,null,0,null,0,0,0,0,0,0,{"$f":"IF($J361=VALUE(RIGHT(Q$5,2)),$I361,0)","v":0},0,0,0,0,0,0,0,"Proof"]
[null,null,null,null,null,null,null,null,0,null,0,0,0,0,0,0,0,0,0,0,0,0,0,0,"Proof"]
[null,null,null,null,null,null,null,null,0,null,0,0,0,0,0,0,0,0,0,0,0,0,0,0,"Proof"]
[null,null,null,null,null,null,null,null,0,null,0,0,0,0,0,0,0,0,0,0,0,0,0,0,"Proof"]
[null,null,null,null,null,null,null,null,0,null,0,0,0,0,0,0,0,0,0,0,0,0,0,0,"Proof"]
[null,null,null,null,null,null,null,null,0,null,0,0,0,0,0,0,0,0,0,0,0,0,0,0,"Proof"]
[null,null,null,null,null,null,null,null,0,null,0,0,0,0,0,0,0,0,0,0,0,0,0,0,"Proof"]
[null,null,null,null,null,null,null,null,0,null,0,0,0,0,0,0,0,0,0,0,0,0,0,0,"Proof"]
[null,null,null,null,null,null,null,null,0,null,0,0,0,0,0,0,0,0,0,0,0,0,0,0,"Proof"]
[null,null,null,null,null,null,null,null,0,null,0,0,0,0,0,0,0,0,0,0,0,0,0,0,"Proof"]
[null,null,null,null,null,null,null,null,0,null,0,0,0,0,0,0,0,0,0,0,0,0,0,0,"Proof"]
[null,null,null,null,null,null,null,null,0,null,0,0,0,0,0,0,0,0,0,0,0,0,0,0,"Proof"]
[null,null,null,null,null,null,null,null,0,null,0,0,0,0,0,0,0,0,0,0,0,0,0,0,"Proof"]
[null,null,null,null,null,null,null,null,0,null,0,0,0,0,0,0,0,0,0,0,0,0,0,0,"Proof"]
[null,null,null,null,null,null,null,null,0,null,0,0,0,0,0,0,0,0,0,0,0,0,0,0,"Proof"]
[null,null,null,null,null,null,null,null,0,null,0,0,0,0,0,0,0,0,0,0,0,0,0,0,"Proof"]
[null,null,null,null,null,null,null,null,0,null,0,0,0,0,0,0,0,0,0,0,0,0,0,0,"Proof"]
[null,null,null,null,null,null,null,null,0,null,0,0,0,0,0,0,0,0,0,0,0,0,0,0,"Proof"]
[null,null,null,null,null,null,null,null,0,null,0,0,0,0,0,0,0,0,0,0,0,0,0,0,"Proof"]
[null,null,null,null,null,null,null,null,0,null,0,0,0,0,0,0,0,0,0,0,0,0,0,0,"Proof"]
[null,null,null,null,null,null,null,null,0,null,0,{"$f":"IF($J381=VALUE(RIGHT(L$5,2)),$I381,0)","v":0},0,0,0,0,0,0,0,0,0,0,0,0,"Proof"]
[null,null,null,null,null,null,null,null,0,null,0,0,0,0,0,0,0,0,0,0,0,0,0,0,"Proof"]
[null,null,null,null,null,null,null,null,0,null,0,0,0,0,0,0,0,0,0,0,0,0,0,0,"Proof"]
[null,null,null,null,null,null,null,null,0,null,0,0,0,0,0,0,0,0,0,0,0,0,0,0,"Proof"]
[null,null,null,null,null,null,null,null,0,null,0,0,0,0,0,0,0,0,0,0,0,0,0,0,"Proof"]
[null,null,null,null,null,null,null,null,0,null,0,0,0,0,0,0,0,0,0,0,0,0,0,0,"Proof"]
[null,null,null,null,null,null,null,null,0,null,0,0,0,0,0,0,0,0,0,0,0,0,0,0,"Proof"]
[null,null,null,null,null,null,null,null,0,null,0,0,0,0,0,0,0,0,0,0,0,0,0,0,"Proof"]
[null,null,null,null,null,null,null,null,{"$f":"SUM(D389:H389)","v":0},null,0,0,0,0,0,0,0,0,0,0,0,0,0,{"$f":"SUM(K389:W389)","v":0},{"$f":"IF(X389=I389,\"Proof\",\"Error\")","v":"Proof"}]
[null,null,null,null,null,null,null,null,0,null,0,0,0,0,0,0,0,0,0,0,0,0,0,0,"Proof"]
[null,null,null,null,null,null,null,null,0,null,0,0,0,0,0,0,0,0,0,0,0,0,0,0,"Proof"]
[null,null,null,null,null,null,null,null,0,null,0,0,0,0,0,0,0,0,0,0,0,0,0,0,"Proof"]
[null,null,null,null,null,null,null,null,0,null,0,0,0,0,0,0,0,0,0,0,0,0,0,0,"Proof"]
[null,null,null,null,null,null,null,null,0,null,0,0,0,0,0,0,0,0,0,0,0,0,0,0,"Proof"]
[null,null,null,null,null,null,null,null,0,null,0,0,0,0,0,0,0,0,0,0,0,0,0,0,"Proof"]
[null,null,null,null,null,null,null,null,0,null,0,0,0,0,0,0,0,0,0,0,0,0,0,0,"Proof"]
[null,null,null,null,null,null,null,null,0,null,0,0,0,0,0,0,0,0,0,0,0,0,0,0,"Proof"]
[null,null,null,null,null,null,null,null,0,null,0,0,0,0,0,0,0,0,0,0,0,0,0,0,"Proof"]
[null,null,null,null,null,null,null,null,0,null,0,0,0,0,0,0,0,0,0,0,0,0,0,0,"Proof"]
[null,null,null,null,null,null,null,null,0,null,0,0,0,0,0,0,0,0,0,{"$f":"IF($J400=VALUE(RIGHT(T$5,2)),$I400,0)","v":0},0,0,0,0,"Proof"]
[null,null,null,null,null,null,null,null,0,null,0,0,0,0,0,0,0,0,0,0,0,0,0,0,"Proof"]
[null,null,null,null,null,null,null,null,0,null,0,0,0,0,0,0,0,0,0,0,0,0,0,0,"Proof"]
[null,null,null,null,null,null,null,null,0,null,0,0,0,0,0,0,0,0,0,0,0,0,0,0,"Proof"]
[null,null,null,null,null,null,null,null,0,null,0,0,0,0,0,0,0,0,0,0,0,0,0,0,"Proof"]
[null,null,null,null,null,null,null,null,0,null,0,0,0,0,0,0,0,0,0,0,0,0,0,0,"Proof"]
[null,null,null,null,null,null,null,null,0,null,0,0,0,0,0,0,0,0,0,0,0,0,0,0,"Proof"]
[null,null,null,null,null,null,null,null,0,null,0,0,0,0,0,0,0,0,0,0,0,0,0,0,"Proof"]
[null,null,null,null,null,null,null,null,0,null,0,0,0,0,0,0,0,0,0,0,0,0,0,0,"Proof"]
[null,null,null,null,null,null,null,null,0,null,0,0,0,0,0,0,0,0,0,0,0,0,0,0,"Proof"]
[null,null,null,null,null,null,null,null,0,null,0,0,0,0,0,0,0,0,0,0,0,0,0,0,"Proof"]
[null,null,null,null,null,null,null,null,0,null,0,0,0,0,0,0,0,0,0,0,0,0,0,0,"Proof"]
[null,null,null,null,null,null,null,null,0,null,0,0,0,0,0,0,0,0,0,0,0,0,0,0,"Proof"]
[null,null,null,null,null,null,null,null,0,null,0,0,0,0,0,0,0,0,0,0,0,0,0,0,"Proof"]
[null,null,null,null,null,null,null,null,0,null,0,0,0,0,0,0,0,0,0,0,0,0,0,0,"Proof"]
[null,null,null,null,null,null,null,null,0,null,0,0,0,0,0,0,0,0,0,0,0,0,0,0,"Proof"]
[null,null,null,null,null,null,null,null,0,null,0,0,0,0,0,0,0,0,0,0,0,0,0,0,"Proof"]
[null,null,null,null,null,null,null,null,0,null,0,0,0,0,0,0,0,0,0,0,0,0,0,0,"Proof"]
[null,null,null,null,null,null,null,null,0,null,0,0,0,0,0,0,0,0,0,0,0,0,0,0,"Proof"]
[null,null,null,null,null,null,null,null,0,null,0,0,0,0,0,0,0,0,0,0,0,0,0,0,"Proof"]
[null,null,null,null,null,null,null,null,0,null,0,0,0,0,{"$f":"IF($J420=VALUE(RIGHT(O$5,2)),$I420,0)","v":0},0,0,0,0,0,0,0,0,0,"Proof"]
[null,null,null,null,null,null,null,null,0,null,0,0,0,0,0,0,0,0,0,0,0,0,0,0,"Proof"]
[null,null,null,null,null,null,null,null,0,null,0,0,0,0,0,0,0,0,0,0,0,0,0,0,"Proof"]
[null,null,null,null,null,null,null,null,0,null,0,0,0,0,0,0,0,0,0,0,0,0,0,0,"Proof"]
[null,null,null,null,null,null,null,null,0,null,0,0,0,0,0,0,0,0,0,0,0,0,0,0,"Proof"]
[null,null,null,null,null,null,null,null,0,null,0,0,0,0,0,0,0,0,0,0,0,0,0,0,"Proof"]
[null,null,null,null,null,null,null,null,0,null,0,0,0,0,0,0,0,0,0,0,0,0,0,0,"Proof"]
[null,null,null,null,null,null,null,null,0,null,0,0,0,0,0,0,0,0,0,0,0,0,0,0,"Proof"]
[null,null,null,null,null,null,null,null,0,null,0,0,0,0,0,0,0,0,0,0,0,0,0,0,"Proof"]
[null,null,null,null,null,null,null,null,0,null,0,0,0,0,0,0,0,0,0,0,0,0,0,0,"Proof"]
[null,null,null,null,null,null,null,null,0,null,0,0,0,0,0,0,0,0,0,0,0,0,0,0,"Proof"]
[null,null,null,null,null,null,null,null,0,null,0,0,0,0,0,0,0,0,0,0,0,0,0,0,"Proof"]
[null,null,null,null,null,null,null,null,0,null,0,0,0,0,0,0,0,0,0,0,0,0,0,0,"Proof"]
[null,null,null,null,null,null,null,null,0,null,0,0,0,0,0,0,0,0,0,0,0,0,0,0,"Proof"]
[null,null,null,null,null,null,null,null,0,null,0,0,0,0,0,0,0,0,0,0,0,0,0,0,"Proof"]
[null,null,null,null,null,null,null,null,0,null,0,0,0,0,0,0,0,0,0,0,0,0,0,0,"Proof"]
[null,null,null,null,null,null,null,null,0,null,0,0,0,0,0,0,0,0,0,0,0,0,0,0,"Proof"]
[null,null,null,null,null,null,null,null,0,null,0,0,0,0,0,0,0,0,0,0,0,0,0,0,"Proof"]
[null,null,null,null,null,null,null,null,0,null,0,0,0,0,0,0,0,0,0,0,0,0,0,0,"Proof"]
[null,null,null,null,null,null,null,null,0,null,0,0,0,0,0,0,0,0,0,0,0,0,{"$f":"IF($J439=VALUE(RIGHT(W$5,2)),$I439,0)","v":0},0,"Proof"]
[null,null,null,null,null,null,null,null,0,null,0,0,0,0,0,0,0,0,0,0,0,0,0,0,"Proof"]
[null,null,null,null,null,null,null,null,0,null,0,0,0,0,0,0,0,0,0,0,0,0,0,0,"Proof"]
[null,null,null,null,null,null,null,null,0,null,0,0,0,0,0,0,0,0,0,0,0,0,0,0,"Proof"]
[null,null,null,null,null,null,null,null,0,null,0,0,0,0,0,0,0,0,0,0,0,0,0,0,"Proof"]
[null,null,null,null,null,null,null,null,0,null,0,0,0,0,0,0,0,0,0,0,0,0,0,0,"Proof"]
[null,null,null,null,null,null,null,null,0,null,0,0,0,0,0,0,0,0,0,0,0,0,0,0,"Proof"]
[null,null,null,null,null,null,null,null,0,null,0,0,0,0,0,0,0,0,0,0,0,0,0,0,"Proof"]
[null,null,null,null,null,null,null,null,0,null,0,0,0,0,0,0,0,0,0,0,0,0,0,0,"Proof"]
[null,null,null,null,null,null,null,null,0,null,0,0,0,0,0,0,0,0,0,0,0,0,0,0,"Proof"]
[null,null,null,null,null,null,null,null,0,null,0,0,0,0,0,0,0,0,0,0,0,0,0,0,"Proof"]
[null,null,null,null,null,null,null,null,0,null,0,0,0,0,0,0,0,0,0,0,0,0,0,0,"Proof"]
[null,null,null,null,null,null,null,null,0,null,0,0,0,0,0,0,0,0,0,0,0,0,0,0,"Proof"]
[null,null,null,null,null,null,null,null,0,null,0,0,0,0,0,0,0,0,0,0,0,0,0,0,"Proof"]
[null,null,null,null,null,null,null,null,{"$f":"SUM(D453:H453)","v":0},null,0,0,0,0,0,0,0,0,0,0,0,0,0,{"$f":"SUM(K453:W453)","v":0},{"$f":"IF(X453=I453,\"Proof\",\"Error\")","v":"Proof"}]
[null,null,null,null,null,null,null,null,0,null,0,0,0,0,0,0,0,0,0,0,0,0,0,0,"Proof"]
[null,null,null,null,null,null,null,null,0,null,0,0,0,0,0,0,0,0,0,0,0,0,0,0,"Proof"]
[null,null,null,null,null,null,null,null,0,null,0,0,0,0,0,0,0,0,0,0,0,0,0,0,"Proof"]
[null,null,null,null,null,null,null,null,0,null,0,0,0,0,0,0,0,0,0,0,0,0,0,0,"Proof"]
[null,null,null,null,null,null,null,null,0,null,0,0,0,0,0,0,0,0,0,0,0,0,0,0,"Proof"]
[null,null,null,null,null,null,null,null,0,null,0,0,0,0,0,0,0,{"$f":"IF($J459=VALUE(RIGHT(R$5,2)),$I459,0)","v":0},0,0,0,0,0,0,"Proof"]
[null,null,null,null,null,null,null,null,0,null,0,0,0,0,0,0,0,0,0,0,0,0,0,0,"Proof"]
[null,null,null,null,null,null,null,null,0,null,0,0,0,0,0,0,0,0,0,0,0,0,0,0,"Proof"]
[null,null,null,null,null,null,null,null,0,null,0,0,0,0,0,0,0,0,0,0,0,0,0,0,"Proof"]
[null,null,null,null,null,null,null,null,0,null,0,0,0,0,0,0,0,0,0,0,0,0,0,0,"Proof"]
[null,null,null,null,null,null,null,null,0,null,0,0,0,0,0,0,0,0,0,0,0,0,0,0,"Proof"]
[null,null,null,null,null,null,null,null,0,null,0,0,0,0,0,0,0,0,0,0,0,0,0,0,"Proof"]
[null,null,null,null,null,null,null,null,0,null,0,0,0,0,0,0,0,0,0,0,0,0,0,0,"Proof"]
[null,null,null,null,null,null,null,null,0,null,0,0,0,0,0,0,0,0,0,0,0,0,0,0,"Proof"]
[null,null,null,null,null,null,null,null,0,null,0,0,0,0,0,0,0,0,0,0,0,0,0,0,"Proof"]
[null,null,null,null,null,null,null,null,0,null,0,0,0,0,0,0,0,0,0,0,0,0,0,0,"Proof"]
[null,null,null,null,null,null,null,null,0,null,0,0,0,0,0,0,0,0,0,0,0,0,0,0,"Proof"]
[null,null,null,null,null,null,null,null,0,null,0,0,0,0,0,0,0,0,0,0,0,0,0,0,"Proof"]
[null,null,null,null,null,null,null,null,0,null,0,0,0,0,0,0,0,0,0,0,0,0,0,0,"Proof"]
[null,null,null,null,null,null,null,null,0,null,0,0,0,0,0,0,0,0,0,0,0,0,0,0,"Proof"]
[null,null,null,null,null,null,null,null,0,null,0,0,0,0,0,0,0,0,0,0,0,0,0,0,"Proof"]
[null,null,null,null,null,null,null,null,0,null,0,0,0,0,0,0,0,0,0,0,0,0,0,0,"Proof"]
[null,null,null,null,null,null,null,null,0,null,0,0,0,0,0,0,0,0,0,0,0,0,0,0,"Proof"]
[null,null,null,null,null,null,null,null,0,null,0,0,0,0,0,0,0,0,0,0,0,0,0,0,"Proof"]
[null,null,null,null,null,null,null,null,0,null,0,0,0,0,0,0,0,0,0,0,0,0,0,0,"Proof"]
[null,null,null,null,null,null,null,null,0,null,0,0,{"$f":"IF($J479=VALUE(RIGHT(M$5,2)),$I479,0)","v":0},0,0,0,0,0,0,0,0,0,0,0,"Proof"]
[null,null,null,null,null,null,null,null,0,null,0,0,0,0,0,0,0,0,0,0,0,0,0,0,"Proof"]
[null,null,null,null,null,null,null,null,0,null,0,0,0,0,0,0,0,0,0,0,0,0,0,0,"Proof"]
[null,null,null,null,null,null,null,null,0,null,0,0,0,0,0,0,0,0,0,0,0,0,0,0,"Proof"]
[null,null,null,null,null,null,null,null,0,null,0,0,0,0,0,0,0,0,0,0,0,0,0,0,"Proof"]
[null,null,null,null,null,null,null,null,0,null,0,0,0,0,0,0,0,0,0,0,0,0,0,0,"Proof"]
[null,null,null,null,null,null,null,null,0,null,0,0,0,0,0,0,0,0,0,0,0,0,0,0,"Proof"]
[null,null,null,null,null,null,null,null,0,null,0,0,0,0,0,0,0,0,0,0,0,0,0,0,"Proof"]
[null,null,null,null,null,null,null,null,0,null,0,0,0,0,0,0,0,0,0,0,0,0,0,0,"Proof"]
[null,null,null,null,null,null,null,null,0,null,0,0,0,0,0,0,0,0,0,0,0,0,0,0,"Proof"]
[null,null,null,null,null,null,null,null,0,null,0,0,0,0,0,0,0,0,0,0,0,0,0,0,"Proof"]
[null,null,null,null,null,null,null,null,0,null,0,0,0,0,0,0,0,0,0,0,0,0,0,0,"Proof"]
[null,null,null,null,null,null,null,null,0,null,0,0,0,0,0,0,0,0,0,0,0,0,0,0,"Proof"]
[null,null,null,null,null,null,null,null,0,null,0,0,0,0,0,0,0,0,0,0,0,0,0,0,"Proof"]
[null,null,null,null,null,null,null,null,0,null,0,0,0,0,0,0,0,0,0,0,0,0,0,0,"Proof"]
[null,null,null,null,null,null,null,null,0,null,0,0,0,0,0,0,0,0,0,0,0,0,0,0,"Proof"]
[null,null,null,null,null,null,null,null,0,null,0,0,0,0,0,0,0,0,0,0,0,0,0,0,"Proof"]
[null,null,null,null,null,null,null,null,null,"CASH FLOW TEMPLATE ENDS HERE.  IF YOU NEED MORE ROWS, INSERT THEM ABOVE ROW 500. "]

{"sheet":"Forecast AR Collections","index":4,"n_rows":501,"n_cols":25,"rows_kept":501,"cut":false,"hidden":false,"merged":[[500,9,500,24],[4,2,5,2],[4,3,5,3],[4,4,5,4],[4,5,5,5],[4,6,5,6],[4,7,5,7],[4,8,5,8],[4,9,5,9],[4,23,5,23],[4,24,5,24]]}
[null,null,null,null,null,null,null,null,null,"C:\\Users\\lenovo\\Google Drive\\james dougal (growthforce)\\B. Cash Flow Files\\QBD - AR Collapsed GF.xlsx"]
[null,null,null,"Expected AR Collections",null,null,null,null,null,"QBD - AR Collapsed GF.xlsx"]
[null,null,null,null,null,null,null,null,null,"C:\\Users\\lenovo\\Google Drive\\james dougal (growthforce)\\B. Cash Flow Files\\"]
[null,null,null,null,null,null,null,null,null,null," <-- Click here to import AR Aging Summary Excel file from Quickbooks download"]
[null,null,"Vendor Name","Current","1 - 30","31 - 60","61 - 90","> 90","Total","Expected Collection Week (enter wk 1-13)",{"$f":"'Cash Flow Summary'!D6","v":"Week 1"},{"$f":"'Cash Flow Summary'!E6","v":"Week 2"},{"$f":"'Cash Flow Summary'!F6","v":"Week 3"},{"$f":"'Cash Flow Summary'!G6","v":"Week 4"},{"$f":"'Cash Flow Summary'!H6","v":"Week 5"},{"$f":"'Cash Flow Summary'!I6","v":"Week 6"},{"$f":"'Cash Flow Summary'!J6","v":"Week 7"},{"$f":"'Cash Flow Summary'!K6","v":"Week 8"},{"$f":"'Cash Flow Summary'!L6","v":"Week 9"},{"$f":"'Cash Flow Summary'!M6","v":"Week 10"},{"$f":"'Cash Flow Summary'!N6","v":"Week 11"},{"$f":"'Cash Flow Summary'!O6","v":"Week 12"},{"$f":"'Cash Flow Summary'!P6","v":"Week 13"},"Total","Proof"]
[null,null,null,null,null,null,null,null,null,null,{"$f":"'Cash Flow Summary'!D7","v":"2019-09-01"},{"$f":"'Cash Flow Summary'!E7","v":"2019-09-08"},{"$f":"'Cash Flow Summary'!F7","v":"2019-09-15"},{"$f":"'Cash Flow Summary'!G7","v":"2019-09-22"},{"$f":"'Cash Flow Summary'!H7","v":"2019-09-29"},{"$f":"'Cash Flow Summary'!I7","v":"2019-10-06"},{"$f":"'Cash Flow Summary'!J7","v":"2019-10-13"},{"$f":"'Cash Flow Summary'!K7","v":"2019-10-20"},{"$f":"'Cash Flow Summary'!L7","v":"2019-10-27"},{"$f":"'Cash Flow Summary'!M7","v":"2019-11-03"},{"$f":"'Cash Flow Summary'!N7","v":"2019-11-10"},{"$f":"'Cash Flow Summary'!O7","v":"2019-11-17"},{"$f":"'Cash Flow Summary'!P7","v":"2019-11-24"}]
[null,null,{"$f":"'Cash Flow Summary'!B6","v":"Version 1.10"}]
[null,null,"Total",{"$f":"ROUND(SUM(D9:D500),5)","v":5150},{"$f":"ROUND(SUM(E9:E500),5)","v":23290},0,0,0,28440,null,{"$f":"ROUND(SUM(K9:K1048576),5)","v":15990},4000,800,1400,6250,0,0,0,0,0,0,0,0,28440]
[null,null,"Hall, Brent",750,null,null,null,null,{"$f":"SUM(D9:H9)","v":750},4,{"$f":"IF($J9=VALUE(RIGHT(K$5,2)),$I9,0)","v":0},{"$f":"IF($J9=VALUE(RIGHT(L$5,2)),$I9,0)","v":0},0,750,0,0,0,0,0,0,0,0,0,{"$f":"SUM(K9:W9)","v":750},{"$f":"IF(X9=I9,\"Proof\",\"Error\")","v":"Proof"}]
[null,null,"Lamb, Angela",650,null,null,null,null,{"$f":"SUM(D10:H10)","v":650},4,0,0,0,650,0,0,0,0,0,0,0,0,0,650]
[null,null,"AC Professional",1250,null,null,null,null,1250,5,0,0,0,0,1250,0,0,0,0,0,0,0,0,1250,"Proof"]
[null,null,"Dearborn Inc",2500,null,null,null,null,2500,5,0,0,0,0,2500,0,0,0,0,0,0,0,0,2500,"Proof"]
[null,null,"Yearling, Kathy",null,550,null,null,null,550,3,0,0,550,0,0,0,0,0,0,0,0,0,0,550,"Proof"]
[null,null,"Barren, K.",null,250,null,null,null,250,3,0,0,250,0,0,0,0,0,0,0,0,0,0,250,"Proof"]
[null,null,"Johnston Services",null,2500,null,null,null,2500,5,0,0,0,0,2500,0,0,0,0,0,0,0,0,2500,"Proof"]
[null,null,"Helping Hands ",null,3750,null,null,null,3750,2,0,3750,0,0,0,0,0,{"$f":"IF($J16=VALUE(RIGHT(R$5,2)),$I16,0)","v":0},0,0,0,0,0,3750,"Proof"]
[null,null,"Jolly, Matt",null,250,null,null,null,250,2,0,250,0,0,0,0,0,0,0,0,0,0,0,250,"Proof"]
[null,null,"Brown, Jere",null,990,null,null,null,990,1,990,0,0,0,0,0,0,0,0,0,0,0,0,990,"Proof"]
[null,null,"ARC Corporation",null,15000,null,null,null,15000,1,15000,0,0,0,0,0,0,0,0,0,0,0,0,15000,"Proof"]
[null,null,null,null,null,null,null,null,0,null,0,0,0,0,0,0,0,0,0,0,0,0,0,0,"Proof"]
[null,null,null,null,null,null,null,null,0,null,0,0,0,0,0,0,0,0,0,0,0,0,0,0,"Proof"]
[null,null,null,null,null,null,null,null,0,null,0,0,0,0,0,0,0,0,0,0,0,0,0,0,"Proof"]
[null,null,null,null,null,null,null,null,0,null,0,0,0,0,0,0,0,0,0,0,0,0,0,0,"Proof"]
[null,null,null,null,null,null,null,null,0,null,0,0,0,0,0,0,0,0,0,0,0,0,0,0,"Proof"]
[null,null,null,null,null,null,null,null,0,null,0,0,0,0,0,0,0,0,0,0,0,0,0,0,"Proof"]
[null,null,null,null,null,null,null,null,0,null,{"$f":"IF($J26=VALUE(RIGHT(K$5,2)),$I26,0)","v":0},0,0,0,0,0,0,0,0,0,0,0,0,0,"Proof"]
[null,null,null,null,null,null,null,null,0,null,0,0,0,0,0,0,0,0,0,0,0,0,0,0,"Proof"]
[null,null,null,null,null,null,null,null,0,null,0,0,0,0,0,0,0,0,0,0,0,0,0,0,"Proof"]
[null,null,null,null,null,null,null,null,0,null,0,0,0,0,0,0,0,0,0,0,0,0,0,0,"Proof"]
[null,null,null,null,null,null,null,null,0,null,0,0,0,0,0,0,0,0,0,0,0,0,0,0,"Proof"]
[null,null,null,null,null,null,null,null,0,null,0,0,0,0,0,0,0,0,0,0,0,0,0,0,"Proof"]
[null,null,null,null,null,null,null,null,0,null,0,0,0,0,0,0,0,0,0,0,0,0,0,0,"Proof"]
[null,null,null,null,null,null,null,null,0,null,0,0,0,0,0,0,0,0,0,0,0,0,0,0,"Proof"]
[null,null,null,null,null,null,null,null,0,null,0,0,0,0,0,0,0,0,0,0,0,0,0,0,"Proof"]
[null,null,null,null,null,null,null,null,0,null,0,0,0,0,0,0,0,0,0,0,0,0,0,0,"Proof"]
[null,null,null,null,null,null,null,null,0,null,0,0,0,0,0,0,0,0,0,0,0,0,0,0,"Proof"]
[null,null,null,null,null,null,null,null,0,null,0,0,0,0,0,0,0,0,0,0,{"$f":"IF($J37=VALUE(RIGHT(U$5,2)),$I37,0)","v":0},0,0,0,"Proof"]
[null,null,null,null,null,null,null,null,0,null,0,0,0,0,0,0,0,0,0,0,0,0,0,0,"Proof"]
[null,null,null,null,null,null,null,null,0,null,0,0,0,0,0,0,0,0,0,0,0,0,0,0,"Proof"]
[null,null,null,null,null,null,null,null,0,null,0,0,0,0,0,0,0,0,0,0,0,0,0,0,"Proof"]
[null,null,null,null,null,null,null,null,0,null,0,0,0,0,0,0,0,0,0,0,0,0,0,0,"Proof"]
[null,null,null,null,null,null,null,null,0,null,0,0,0,0,0,0,0,0,0,0,0,0,0,0,"Proof"]
[null,null,null,null,null,null,null,null,0,null,0,0,0,0,0,0,0,0,0,0,0,0,0,0,"Proof"]
[null,null,null,null,null,null,null,null,0,null,0,0,0,0,0,0,0,0,0,0,0,0,0,0,"Proof"]
[null,null,null,null,null,null,null,null,0,null,0,0,0,0,0,0,0,0,0,0,0,0,0,0,"Proof"]
[null,null,null,null,null,null,null,null,0,null,0,0,0,0,0,0,0,0,0,0,0,0,0,0,"Proof"]
[null,null,null,null,null,null,null,null,0,null,0,0,0,0,0,0,0,0,0,0,0,0,0,0,"Proof"]
[null,null,null,null,null,null,null,null,0,null,0,0,0,0,0,0,0,0,0,0,0,0,0,0,"Proof"]
[null,null,null,null,null,null,null,null,0,null,0,0,0,0,0,0,0,0,0,0,0,0,0,0,"Proof"]
[null,null,null,null,null,null,null,null,0,null,0,0,0,0,0,0,0,0,0,0,0,0,0,0,"Proof"]
[null,null,null,null,null,null,null,null,0,null,0,0,0,0,0,0,0,0,0,0,0,0,0,0,"Proof"]
[null,null,null,null,null,null,null,null,0,null,0,0,0,0,0,0,0,0,0,0,0,0,0,0,"Proof"]
[null,null,null,null,null,null,null,null,0,null,0,0,0,0,0,0,0,0,0,0,0,0,0,0,"Proof"]
[null,null,null,null,null,null,null,null,0,null,0,0,0,0,0,0,0,0,0,0,0,0,0,0,"Proof"]
[null,null,null,null,null,null,null,null,0,null,0,0,0,0,0,0,0,0,0,0,0,0,0,0,"Proof"]
[null,null,null,null,null,null,null,null,0,null,0,0,0,0,0,0,0,0,0,0,0,0,0,0,"Proof"]
[null,null,null,null,null,null,null,null,0,null,0,0,0,0,0,0,0,0,0,0,0,0,0,0,"Proof"]
[null,null,null,null,null,null,null,null,0,null,0,0,0,0,0,0,0,0,0,0,0,0,0,0,"Proof"]
[null,null,null,null,null,null,null,null,0,null,0,0,0,0,0,0,0,0,0,0,0,0,0,0,"Proof"]
[null,null,null,null,null,null,null,null,0,null,0,0,0,0,0,0,0,0,0,0,0,0,0,0,"Proof"]
[null,null,null,null,null,null,null,null,0,null,0,0,0,0,0,0,0,0,0,0,0,0,0,0,"Proof"]
[null,null,null,null,null,null,null,null,0,null,0,0,0,0,0,0,0,0,0,0,0,0,0,0,"Proof"]
[null,null,null,null,null,null,null,null,0,null,0,0,0,0,0,0,0,0,0,0,0,0,0,0,"Proof"]
[null,null,null,null,null,null,null,null,0,null,0,0,0,0,0,0,0,0,0,0,0,0,0,0,"Proof"]
[null,null,null,null,null,null,null,null,0,null,0,0,0,0,0,0,0,0,0,0,0,0,0,0,"Proof"]
[null,null,null,null,null,null,null,null,0,null,0,0,0,0,0,0,0,0,0,0,0,0,0,0,"Proof"]
[null,null,null,null,null,null,null,null,0,null,0,0,0,0,0,0,0,0,0,0,0,0,0,0,"Proof"]
[null,null,null,null,null,null,null,null,0,null,0,0,0,0,0,0,0,0,0,0,0,0,0,0,"Proof"]
[null,null,null,null,null,null,null,null,0,null,0,0,0,0,0,0,0,0,0,0,0,0,0,0,"Proof"]
[null,null,null,null,null,null,null,null,0,null,0,0,0,0,0,0,0,0,0,0,0,0,0,0,"Proof"]
[null,null,null,null,null,null,null,null,0,null,0,0,0,0,0,0,0,0,0,0,0,0,0,0,"Proof"]
[null,null,null,null,null,null,null,null,0,null,0,0,0,0,0,0,0,0,0,0,0,0,0,0,"Proof"]
[null,null,null,null,null,null,null,null,0,null,0,0,0,0,0,0,0,0,0,0,0,0,0,0,"Proof"]
[null,null,null,null,null,null,null,null,{"$f":"SUM(D74:H74)","v":0},null,0,0,0,0,0,0,0,0,0,0,0,0,0,{"$f":"SUM(K74:W74)","v":0},{"$f":"IF(X74=I74,\"Proof\",\"Error\")","v":"Proof"}]
[null,null,null,null,null,null,null,null,0,null,0,0,0,0,0,0,0,0,0,0,0,0,0,0,"Proof"]
[null,null,null,null,null,null,null,null,0,null,0,{"$f":"IF($J76=VALUE(RIGHT(L$5,2)),$I76,0)","v":0},0,0,0,0,0,0,0,0,0,0,0,0,"Proof"]
[null,null,null,null,null,null,null,null,0,null,{"$f":"IF($J77=VALUE(RIGHT(K$5,2)),$I77,0)","v":0},0,0,0,0,0,0,0,0,0,0,0,0,0,"Proof"]
[null,null,null,null,null,null,null,null,0,null,0,0,0,0,0,0,0,0,0,0,0,0,0,0,"Proof"]
[null,null,null,null,null,null,null,null,0,null,0,0,0,0,0,0,0,0,0,0,0,0,0,0,"Proof"]
[null,null,null,null,null,null,null,null,0,null,0,0,0,0,0,0,0,0,0,0,0,0,0,0,"Proof"]
[null,null,null,null,null,null,null,null,0,null,0,0,0,0,0,0,0,0,0,0,0,0,0,0,"Proof"]
[null,null,null,null,null,null,null,null,0,null,0,0,0,0,0,0,0,0,0,0,0,0,0,0,"Proof"]
[null,null,null,null,null,null,null,null,0,null,0,0,0,0,0,0,0,0,0,0,0,0,0,0,"Proof"]
[null,null,null,null,null,null,null,null,0,null,0,0,0,0,0,0,0,0,0,0,0,0,0,0,"Proof"]
[null,null,null,null,null,null,null,null,0,null,0,0,0,0,0,0,0,0,0,0,0,0,0,0,"Proof"]
[null,null,null,null,null,null,null,null,0,null,0,0,0,0,0,0,0,0,0,0,0,0,0,0,"Proof"]
[null,null,null,null,null,null,null,null,0,null,0,0,0,0,0,0,0,0,0,0,0,0,0,0,"Proof"]
[null,null,null,null,null,null,null,null,0,null,0,0,0,0,0,0,0,0,0,0,0,0,0,0,"Proof"]
[null,null,null,null,null,null,null,null,0,null,0,0,0,0,0,0,0,0,0,0,0,0,0,0,"Proof"]
[null,null,null,null,null,null,null,null,0,null,0,0,0,0,0,0,0,0,0,0,0,0,0,0,"Proof"]
[null,null,null,null,null,null,null,null,0,null,0,0,0,0,0,0,0,0,0,0,0,0,0,0,"Proof"]
[null,null,null,null,null,null,null,null,0,null,0,0,0,0,0,0,0,0,0,0,0,0,0,0,"Proof"]
[null,null,null,null,null,null,null,null,0,null,0,0,0,0,0,0,0,0,0,0,0,0,0,0,"Proof"]
[null,null,null,null,null,null,null,null,0,null,0,0,0,0,0,0,0,0,0,0,0,0,0,0,"Proof"]
[null,null,null,null,null,null,null,null,0,null,0,0,0,0,0,0,0,0,0,0,0,0,0,0,"Proof"]
[null,null,null,null,null,null,null,null,0,null,0,0,0,0,0,0,0,0,0,0,0,0,0,0,"Proof"]
[null,null,null,null,null,null,null,null,0,null,0,0,0,0,{"$f":"IF($J97=VALUE(RIGHT(O$5,2)),$I97,0)","v":0},0,0,0,0,0,0,0,0,0,"Proof"]
[null,null,null,null,null,null,null,null,0,null,0,0,0,0,0,0,0,0,0,0,0,0,0,0,"Proof"]
[null,null,null,null,null,null,null,null,0,null,0,0,0,0,0,0,0,0,0,0,0,0,0,0,"Proof"]
[null,null,null,null,null,null,null,null,0,null,0,0,0,0,0,0,0,0,0,0,0,0,0,0,"Proof"]
[null,null,null,null,null,null,null,null,0,null,0,0,0,0,0,0,0,0,0,0,0,0,0,0,"Proof"]
[null,null,null,null,null,null,null,null,0,null,0,0,0,0,0,0,0,0,0,0,0,0,0,0,"Proof"]
[null,null,null,null,null,null,null,null,0,null,0,0,0,0,0,0,0,0,0,0,0,0,0,0,"Proof"]
[null,null,null,null,null,null,null,null,0,null,0,0,0,0,0,0,0,0,0,0,0,0,0,0,"Proof"]
[null,null,null,null,null,null,null,null,0,null,0,0,0,0,0,0,0,0,0,0,0,0,0,0,"Proof"]
[null,null,null,null,null,null,null,null,0,null,0,0,0,0,0,0,0,0,0,0,0,0,0,0,"Proof"]
[null,null,null,null,null,null,null,null,0,null,0,0,0,0,0,0,0,0,0,0,0,0,0,0,"Proof"]
[null,null,null,null,null,null,null,null,0,null,0,0,0,0,0,0,0,0,0,0,0,0,0,0,"Proof"]
[null,null,null,null,null,null,null,null,0,null,0,0,0,0,0,0,0,0,0,0,0,0,0,0,"Proof"]
[null,null,null,null,null,null,null,null,0,null,0,0,0,0,0,0,0,0,0,0,0,0,0,0,"Proof"]
[null,null,null,null,null,null,null,null,0,null,0,0,0,0,0,0,0,0,0,0,0,0,0,0,"Proof"]
[null,null,null,null,null,null,null,null,0,null,0,0,0,0,0,0,0,0,0,0,0,0,0,0,"Proof"]
[null,null,null,null,null,null,null,null,0,null,0,0,0,0,0,0,0,0,0,0,0,0,0,0,"Proof"]
[null,null,null,null,null,null,null,null,0,null,0,0,0,0,0,0,0,0,0,0,0,0,0,0,"Proof"]
[null,null,null,null,null,null,null,null,0,null,0,0,0,0,0,0,0,0,0,0,0,0,0,0,"Proof"]
[null,null,null,null,null,null,null,null,0,null,0,0,0,0,0,0,0,0,0,0,0,0,0,0,"Proof"]
[null,null,null,null,null,null,null,null,0,null,0,0,0,0,0,0,0,0,0,0,0,0,0,0,"Proof"]
[null,null,null,null,null,null,null,null,0,null,0,0,0,0,0,0,0,{"$f":"IF($J118=VALUE(RIGHT(R$5,2)),$I118,0)","v":0},0,0,0,0,0,0,"Proof"]
[null,null,null,null,null,null,null,null,0,null,0,0,0,0,0,0,0,0,0,0,0,0,0,0,"Proof"]
[null,null,null,null,null,null,null,null,0,null,0,0,0,0,0,0,0,0,0,0,0,0,0,0,"Proof"]
[null,null,null,null,null,null,null,null,0,null,0,0,0,0,0,0,0,0,0,0,0,0,0,0,"Proof"]
[null,null,null,null,null,null,null,null,0,null,0,0,0,0,0,0,0,0,0,0,0,0,0,0,"Proof"]
[null,null,null,null,null,null,null,null,0,null,0,0,0,0,0,0,0,0,0,0,0,0,0,0,"Proof"]
[null,null,null,null,null,null,null,null,0,null,0,0,0,0,0,0,0,0,0,0,0,0,0,0,"Proof"]
[null,null,null,null,null,null,null,null,0,null,0,0,0,0,0,0,0,0,0,0,0,0,0,0,"Proof"]
[null,null,null,null,null,null,null,null,0,null,0,0,0,0,0,0,0,0,0,0,0,0,0,0,"Proof"]
[null,null,null,null,null,null,null,null,0,null,0,0,0,0,0,0,0,0,0,0,0,0,0,0,"Proof"]
[null,null,null,null,null,null,null,null,0,null,0,0,0,0,0,0,0,0,0,0,0,0,0,0,"Proof"]
[null,null,null,null,null,null,null,null,0,null,0,0,0,0,0,0,0,0,0,0,0,0,0,0,"Proof"]
[null,null,null,null,null,null,null,null,0,null,0,0,0,0,0,0,0,0,0,0,0,0,0,0,"Proof"]
[null,null,null,null,null,null,null,null,0,null,0,0,0,0,0,0,0,0,0,0,0,0,0,0,"Proof"]
[null,null,null,null,null,null,null,null,0,null,0,0,0,0,0,0,0,0,0,0,0,0,0,0,"Proof"]
[null,null,null,null,null,null,null,null,0,null,0,0,0,0,0,0,0,0,0,0,0,0,0,0,"Proof"]
[null,null,null,null,null,null,null,null,0,null,0,0,0,0,0,0,0,0,0,0,0,0,0,0,"Proof"]
[null,null,null,null,null,null,null,null,0,null,0,0,0,0,0,0,0,0,0,0,0,0,0,0,"Proof"]
[null,null,null,null,null,null,null,null,0,null,0,0,0,0,0,0,0,0,0,0,0,0,0,0,"Proof"]
[null,null,null,null,null,null,null,null,0,null,0,0,0,0,0,0,0,0,0,0,0,0,0,0,"Proof"]
[null,null,null,null,null,null,null,null,{"$f":"SUM(D138:H138)","v":0},null,0,0,0,0,0,0,0,0,0,0,0,0,0,{"$f":"SUM(K138:W138)","v":0},{"$f":"IF(X138=I138,\"Proof\",\"Error\")","v":"Proof"}]
[null,null,null,null,null,null,null,null,0,null,0,0,0,0,0,0,0,0,0,0,{"$f":"IF($J139=VALUE(RIGHT(U$5,2)),$I139,0)","v":0},0,0,0,"Proof"]
[null,null,null,null,null,null,null,null,0,null,0,0,0,0,0,0,0,0,0,0,0,0,0,0,"Proof"]
[null,null,null,null,null,null,null,null,0,null,{"$f":"IF($J141=VALUE(RIGHT(K$5,2)),$I141,0)","v":0},0,0,0,0,0,0,0,0,0,0,0,0,0,"Proof"]
[null,null,null,null,null,null,null,null,0,null,0,0,0,0,0,0,0,0,0,0,0,0,0,0,"Proof"]
[null,null,null,null,null,null,null,null,0,null,0,0,0,0,0,0,0,0,0,0,0,0,0,0,"Proof"]
[null,null,null,null,null,null,null,null,0,null,0,0,0,0,0,0,0,0,0,0,0,0,0,0,"Proof"]
[null,null,null,null,null,null,null,null,0,null,0,0,0,0,0,0,0,0,0,0,0,0,0,0,"Proof"]
[null,null,null,null,null,null,null,null,0,null,0,0,0,0,0,0,0,0,0,0,0,0,0,0,"Proof"]
[null,null,null,null,null,null,null,null,0,null,0,0,0,0,0,0,0,0,0,0,0,0,0,0,"Proof"]
[null,null,null,null,null,null,null,null,0,null,0,0,0,0,0,0,0,0,0,0,0,0,0,0,"Proof"]
[null,null,null,null,null,null,null,null,0,null,0,0,0,0,0,0,0,0,0,0,0,0,0,0,"Proof"]
[null,null,null,null,null,null,null,null,0,null,0,0,0,0,0,0,0,0,0,0,0,0,0,0,"Proof"]
[null,null,null,null,null,null,null,null,0,null,0,0,0,0,0,0,0,0,0,0,0,0,0,0,"Proof"]
[null,null,null,null,null,null,null,null,0,null,0,0,0,0,0,0,0,0,0,0,0,0,0,0,"Proof"]
[null,null,null,null,null,null,null,null,0,null,0,0,0,0,0,0,0,0,0,0,0,0,0,0,"Proof"]
[null,null,null,null,null,null,null,null,0,null,0,0,0,0,0,0,0,0,0,0,0,0,0,0,"Proof"]
[null,null,null,null,null,null,null,null,0,null,0,0,0,0,0,0,0,0,0,0,0,0,0,0,"Proof"]
[null,null,null,null,null,null,null,null,0,null,0,0,0,0,0,0,0,0,0,0,0,0,0,0,"Proof"]
[null,null,null,null,null,null,null,null,0,null,0,0,0,0,0,0,0,0,0,0,0,0,0,0,"Proof"]
[null,null,null,null,null,null,null,null,0,null,0,0,0,0,0,0,0,0,0,0,0,0,0,0,"Proof"]
[null,null,null,null,null,null,null,null,0,null,0,0,0,0,0,0,0,0,0,0,0,0,0,0,"Proof"]
[null,null,null,null,null,null,null,null,0,null,0,0,0,0,0,0,0,0,0,0,0,0,0,0,"Proof"]
[null,null,null,null,null,null,null,null,0,null,0,0,0,0,0,0,0,0,0,0,0,0,0,0,"Proof"]
[null,null,null,null,null,null,null,null,0,null,0,0,0,0,0,0,0,0,0,0,0,0,0,0,"Proof"]
[null,null,null,null,null,null,null,null,0,null,0,0,0,0,0,0,0,0,0,0,0,0,0,0,"Proof"]
[null,null,null,null,null,null,null,null,0,null,0,0,0,0,0,0,0,0,0,0,0,0,0,0,"Proof"]
[null,null,null,null,null,null,null,null,0,null,0,0,0,0,0,0,0,0,0,0,0,0,0,0,"Proof"]
[null,null,null,null,null,null,null,null,0,null,0,0,0,0,0,0,0,0,0,0,0,0,0,0,"Proof"]
[null,null,null,null,null,null,null,null,0,null,0,0,0,0,0,0,0,0,0,0,0,0,0,0,"Proof"]
[null,null,null,null,null,null,null,null,0,null,0,0,0,0,0,0,0,0,0,0,0,0,0,0,"Proof"]
[null,null,null,null,null,null,null,null,0,null,0,0,0,0,0,0,0,0,0,0,0,0,0,0,"Proof"]
[null,null,null,null,null,null,null,null,0,null,0,0,0,0,0,0,0,0,0,0,0,0,0,0,"Proof"]
[null,null,null,null,null,null,null,null,0,null,0,0,0,0,0,0,0,0,0,0,0,0,0,0,"Proof"]
[null,null,null,null,null,null,null,null,0,null,0,0,0,0,0,0,0,0,0,0,0,0,0,0,"Proof"]
[null,null,null,null,null,null,null,null,0,null,0,0,0,0,0,0,0,0,0,0,0,0,0,0,"Proof"]
[null,null,null,null,null,null,null,null,0,null,0,0,0,0,0,0,0,0,0,0,0,0,0,0,"Proof"]
[null,null,null,null,null,null,null,null,0,null,0,0,0,0,0,0,0,0,0,0,0,0,0,0,"Proof"]
[null,null,null,null,null,null,null,null,0,null,0,0,0,0,0,0,0,0,0,0,0,0,0,0,"Proof"]
[null,null,null,null,null,null,null,null,0,null,0,0,0,0,0,0,0,0,0,0,0,0,0,0,"Proof"]
[null,null,null,null,null,null,null,null,0,null,0,0,0,0,0,0,0,0,0,0,0,0,0,0,"Proof"]
[null,null,null,null,null,null,null,null,0,null,0,{"$f":"IF($J179=VALUE(RIGHT(L$5,2)),$I179,0)","v":0},0,0,0,0,0,0,0,0,0,0,0,0,"Proof"]
[null,null,null,null,null,null,null,null,0,null,{"$f":"IF($J180=VALUE(RIGHT(K$5,2)),$I180,0)","v":0},0,0,0,0,0,0,0,0,0,0,0,0,0,"Proof"]
[null,null,null,null,null,null,null,null,0,null,0,0,0,0,0,0,0,0,0,0,0,0,0,0,"Proof"]
[null,null,null,null,null,null,null,null,0,null,0,0,0,0,0,0,0,0,0,0,0,0,0,0,"Proof"]
[null,null,null,null,null,null,null,null,0,null,0,0,0,0,0,0,0,0,0,0,0,0,0,0,"Proof"]
[null,null,null,null,null,null,null,null,0,null,0,0,0,0,0,0,0,0,0,0,0,0,0,0,"Proof"]
[null,null,null,null,null,null,null,null,0,null,0,0,0,0,0,0,0,0,0,0,0,0,0,0,"Proof"]
[null,null,null,null,null,null,null,null,0,null,0,0,0,0,0,0,0,0,0,0,0,0,0,0,"Proof"]
[null,null,null,null,null,null,null,null,0,null,0,0,0,0,0,0,0,0,0,0,0,0,0,0,"Proof"]
[null,null,null,null,null,null,null,null,0,null,0,0,0,0,0,0,0,0,0,0,0,0,0,0,"Proof"]
[null,null,null,null,null,null,null,null,0,null,0,0,0,0,0,0,0,0,0,0,0,0,0,0,"Proof"]
[null,null,null,null,null,null,null,null,0,null,0,0,0,0,0,0,0,0,0,0,0,0,0,0,"Proof"]
[null,null,null,null,null,null,null,null,0,null,0,0,0,0,0,0,0,0,0,0,0,0,0,0,"Proof"]
[null,null,null,null,null,null,null,null,0,null,0,0,0,0,0,0,0,0,0,0,0,0,0,0,"Proof"]
[null,null,null,null,null,null,null,null,0,null,0,0,0,0,0,0,0,0,0,0,0,0,0,0,"Proof"]
[null,null,null,null,null,null,null,null,0,null,0,0,0,0,0,0,0,0,0,0,0,0,0,0,"Proof"]
[null,null,null,null,null,null,null,null,0,null,0,0,0,0,0,0,0,0,0,0,0,0,0,0,"Proof"]
[null,null,null,null,null,null,null,null,0,null,0,0,0,0,0,0,0,0,0,0,0,0,0,0,"Proof"]
[null,null,null,null,null,null,null,null,0,null,0,0,0,0,0,0,0,0,0,0,0,0,0,0,"Proof"]
[null,null,null,null,null,null,null,null,0,null,0,0,0,0,0,0,0,0,0,0,0,0,0,0,"Proof"]
[null,null,null,null,null,null,null,null,0,null,0,0,0,0,0,0,0,0,0,0,0,0,0,0,"Proof"]
[null,null,null,null,null,null,null,null,0,null,0,0,0,0,{"$f":"IF($J200=VALUE(RIGHT(O$5,2)),$I200,0)","v":0},0,0,0,0,0,0,0,0,0,"Proof"]
[null,null,null,null,null,null,null,null,0,null,0,0,0,0,0,0,0,0,0,0,0,0,0,0,"Proof"]
[null,null,null,null,null,null,null,null,{"$f":"SUM(D202:H202)","v":0},null,0,0,0,0,0,0,0,0,0,0,0,0,0,{"$f":"SUM(K202:W202)","v":0},{"$f":"IF(X202=I202,\"Proof\",\"Error\")","v":"Proof"}]
[null,null,null,null,null,null,null,null,0,null,0,0,0,0,0,0,0,0,0,0,0,0,0,0,"Proof"]
[null,null,null,null,null,null,null,null,0,null,0,0,0,0,0,0,0,0,0,0,0,0,0,0,"Proof"]
[null,null,null,null,null,null,null,null,0,null,0,0,0,0,0,0,0,0,0,0,0,0,0,0,"Proof"]
[null,null,null,null,null,null,null,null,0,null,0,0,0,0,0,0,0,0,0,0,0,0,0,0,"Proof"]
[null,null,null,null,null,null,null,null,0,null,0,0,0,0,0,0,0,0,0,0,0,0,0,0,"Proof"]
[null,null,null,null,null,null,null,null,0,null,0,0,0,0,0,0,0,0,0,0,0,0,0,0,"Proof"]
[null,null,null,null,null,null,null,null,0,null,0,0,0,0,0,0,0,0,0,0,0,0,0,0,"Proof"]
[null,null,null,null,null,null,null,null,0,null,0,0,0,0,0,0,0,0,0,0,0,0,0,0,"Proof"]
[null,null,null,null,null,null,null,null,0,null,0,0,0,0,0,0,0,0,0,0,0,0,0,0,"Proof"]
[null,null,null,null,null,null,null,null,0,null,0,0,0,0,0,0,0,0,0,0,0,0,0,0,"Proof"]
[null,null,null,null,null,null,null,null,0,null,0,0,0,0,0,0,0,0,0,0,0,0,0,0,"Proof"]
[null,null,null,null,null,null,null,null,0,null,0,0,0,0,0,0,0,0,0,0,0,0,0,0,"Proof"]
[null,null,null,null,null,null,null,null,0,null,0,0,0,0,0,0,0,0,0,0,0,0,0,0,"Proof"]
[null,null,null,null,null,null,null,null,0,null,0,0,0,0,0,0,0,0,0,0,0,0,0,0,"Proof"]
[null,null,null,null,null,null,null,null,0,null,0,0,0,0,0,0,0,0,0,0,0,0,0,0,"Proof"]
[null,null,null,null,null,null,null,null,0,null,0,0,0,0,0,0,0,0,0,0,0,0,0,0,"Proof"]
[null,null,null,null,null,null,null,null,0,null,0,0,0,0,0,0,0,0,0,0,0,0,0,0,"Proof"]
[null,null,null,null,null,null,null,null,0,null,0,0,0,0,0,0,0,0,0,0,0,0,0,0,"Proof"]
[null,null,null,null,null,null,null,null,0,null,0,0,0,0,0,0,0,{"$f":"IF($J221=VALUE(RIGHT(R$5,2)),$I221,0)","v":0},0,0,0,0,0,0,"Proof"]
[null,null,null,null,null,null,null,null,0,null,0,0,0,0,0,0,0,0,0,0,0,0,0,0,"Proof"]
[null,null,null,null,null,null,null,null,0,null,0,0,0,0,0,0,0,0,0,0,0,0,0,0,"Proof"]
[null,null,null,null,null,null,null,null,0,null,0,0,0,0,0,0,0,0,0,0,0,0,0,0,"Proof"]
[null,null,null,null,null,null,null,null,0,null,0,0,0,0,0,0,0,0,0,0,0,0,0,0,"Proof"]
[null,null,null,null,null,null,null,null,0,null,0,0,0,0,0,0,0,0,0,0,0,0,0,0,"Proof"]
[null,null,null,null,null,null,null,null,0,null,0,0,0,0,0,0,0,0,0,0,0,0,0,0,"Proof"]
[null,null,null,null,null,null,null,null,0,null,0,0,0,0,0,0,0,0,0,0,0,0,0,0,"Proof"]
[null,null,null,null,null,null,null,null,0,null,0,0,0,0,0,0,0,0,0,0,0,0,0,0,"Proof"]
[null,null,null,null,null,null,null,null,0,null,0,0,0,0,0,0,0,0,0,0,0,0,0,0,"Proof"]
[null,null,null,null,null,null,null,null,0,null,0,0,0,0,0,0,0,0,0,0,0,0,0,0,"Proof"]
[null,null,null,null,null,null,null,null,0,null,0,0,0,0,0,0,0,0,0,0,0,0,0,0,"Proof"]
[null,null,null,null,null,null,null,null,0,null,0,0,0,0,0,0,0,0,0,0,0,0,0,0,"Proof"]
[null,null,null,null,null,null,null,null,0,null,0,0,0,0,0,0,0,0,0,0,0,0,0,0,"Proof"]
[null,null,null,null,null,null,null,null,0,null,0,0,0,0,0,0,0,0,0,0,0,0,0,0,"Proof"]
[null,null,null,null,null,null,null,null,0,null,0,0,0,0,0,0,0,0,0,0,0,0,0,0,"Proof"]
[null,null,null,null,null,null,null,null,0,null,0,0,0,0,0,0,0,0,0,0,0,0,0,0,"Proof"]
[null,null,null,null,null,null,null,null,0,null,0,0,0,0,0,0,0,0,0,0,0,0,0,0,"Proof"]
[null,null,null,null,null,null,null,null,0,null,0,0,0,0,0,0,0,0,0,0,0,0,0,0,"Proof"]
[null,null,null,null,null,null,null,null,0,null,0,0,0,0,0,0,0,0,0,0,0,0,0,0,"Proof"]
[null,null,null,null,null,null,null,null,0,null,0,0,0,0,0,0,0,0,0,0,0,0,0,0,"Proof"]
[null,null,null,null,null,null,null,null,0,null,0,0,0,0,0,0,0,0,0,0,{"$f":"IF($J242=VALUE(RIGHT(U$5,2)),$I242,0)","v":0},0,0,0,"Proof"]
[null,null,null,null,null,null,null,null,0,null,0,0,0,0,0,0,0,0,0,0,0,0,0,0,"Proof"]
[null,null,null,null,null,null,null,null,0,null,{"$f":"IF($J244=VALUE(RIGHT(K$5,2)),$I244,0)","v":0},0,0,0,0,0,0,0,0,0,0,0,0,0,"Proof"]
[null,null,null,null,null,null,null,null,0,null,0,0,0,0,0,0,0,0,0,0,0,0,0,0,"Proof"]
[null,null,null,null,null,null,null,null,0,null,0,0,0,0,0,0,0,0,0,0,0,0,0,0,"Proof"]
[null,null,null,null,null,null,null,null,0,null,0,0,0,0,0,0,0,0,0,0,0,0,0,0,"Proof"]
[null,null,null,null,null,null,null,null,0,null,0,0,0,0,0,0,0,0,0,0,0,0,0,0,"Proof"]
[null,null,null,null,null,null,null,null,0,null,0,0,0,0,0,0,0,0,0,0,0,0,0,0,"Proof"]
[null,null,null,null,null,null,null,null,0,null,0,0,0,0,0,0,0,0,0,0,0,0,0,0,"Proof"]
[null,null,null,null,null,null,null,null,0,null,0,0,0,0,0,0,0,0,0,0,0,0,0,0,"Proof"]
[null,null,null,null,null,null,null,null,0,null,0,0,0,0,0,0,0,0,0,0,0,0,0,0,"Proof"]
[null,null,null,null,null,null,null,null,0,null,0,0,0,0,0,0,0,0,0,0,0,0,0,0,"Proof"]
[null,null,null,null,null,null,null,null,0,null,0,0,0,0,0,0,0,0,0,0,0,0,0,0,"Proof"]
[null,null,null,null,null,null,null,null,0,null,0,0,0,0,0,0,0,0,0,0,0,0,0,0,"Proof"]
[null,null,null,null,null,null,null,null,0,null,0,0,0,0,0,0,0,0,0,0,0,0,0,0,"Proof"]
[null,null,null,null,null,null,null,null,0,null,0,0,0,0,0,0,0,0,0,0,0,0,0,0,"Proof"]
[null,null,null,null,null,null,null,null,0,null,0,0,0,0,0,0,0,0,0,0,0,0,0,0,"Proof"]
[null,null,null,null,null,null,null,null,0,null,0,0,0,0,0,0,0,0,0,0,0,0,0,0,"Proof"]
[null,null,null,null,null,null,null,null,0,null,0,0,0,0,0,0,0,0,0,0,0,0,0,0,"Proof"]
[null,null,null,null,null,null,null,null,0,null,0,0,0,0,0,0,0,0,0,0,0,0,0,0,"Proof"]
[null,null,null,null,null,null,null,null,0,null,0,0,0,0,0,0,0,0,0,0,0,0,0,0,"Proof"]
[null,null,null,null,null,null,null,null,0,null,0,0,0,0,0,0,0,0,0,0,0,0,0,0,"Proof"]
[null,null,null,null,null,null,null,null,0,null,0,0,0,0,0,0,0,0,0,0,0,0,0,0,"Proof"]
[null,null,null,null,null,null,null,null,0,null,0,0,0,0,0,0,0,0,0,0,0,0,0,0,"Proof"]
[null,null,null,null,null,null,null,null,{"$f":"SUM(D266:H266)","v":0},null,0,0,0,0,0,0,0,0,0,0,0,0,0,{"$f":"SUM(K266:W266)","v":0},{"$f":"IF(X266=I266,\"Proof\",\"Error\")","v":"Proof"}]
[null,null,null,null,null,null,null,null,0,null,0,0,0,0,0,0,0,0,0,0,0,0,0,0,"Proof"]
[null,null,null,null,null,null,null,null,0,null,0,0,0,0,0,0,0,0,0,0,0,0,0,0,"Proof"]
[null,null,null,null,null,null,null,null,0,null,0,0,0,0,0,0,0,0,0,0,0,0,0,0,"Proof"]
[null,null,null,null,null,null,null,null,0,null,0,0,0,0,0,0,0,0,0,0,0,0,0,0,"Proof"]
[null,null,null,null,null,null,null,null,0,null,0,0,0,0,0,0,0,0,0,0,0,0,0,0,"Proof"]
[null,null,null,null,null,null,null,null,0,null,0,0,0,0,0,0,0,0,0,0,0,0,0,0,"Proof"]
[null,null,null,null,null,null,null,null,0,null,0,0,0,0,0,0,0,0,0,0,0,0,0,0,"Proof"]
[null,null,null,null,null,null,null,null,0,null,0,0,0,0,0,0,0,0,0,0,0,0,0,0,"Proof"]
[null,null,null,null,null,null,null,null,0,null,0,0,0,0,0,0,0,0,0,0,0,0,0,0,"Proof"]
[null,null,null,null,null,null,null,null,0,null,0,0,0,0,0,0,0,0,0,0,0,0,0,0,"Proof"]
[null,null,null,null,null,null,null,null,0,null,0,0,0,0,0,0,0,0,0,0,0,0,0,0,"Proof"]
[null,null,null,null,null,null,null,null,0,null,0,0,0,0,0,0,0,0,0,0,0,0,0,0,"Proof"]
[null,null,null,null,null,null,null,null,0,null,0,0,0,0,0,0,0,0,0,0,0,0,0,0,"Proof"]
[null,null,null,null,null,null,null,null,0,null,0,0,0,0,0,0,0,0,0,0,0,0,0,0,"Proof"]
[null,null,null,null,null,null,null,null,0,null,0,0,0,0,0,0,0,0,0,0,0,0,0,0,"Proof"]
[null,null,null,null,null,null,null,null,0,null,0,{"$f":"IF($J282=VALUE(RIGHT(L$5,2)),$I282,0)","v":0},0,0,0,0,0,0,0,0,0,0,0,0,"Proof"]
[null,null,null,null,null,null,null,null,0,null,{"$f":"IF($J283=VALUE(RIGHT(K$5,2)),$I283,0)","v":0},0,0,0,0,0,0,0,0,0,0,0,0,0,"Proof"]
[null,null,null,null,null,null,null,null,0,null,0,0,0,0,0,0,0,0,0,0,0,0,0,0,"Proof"]
[null,null,null,null,null,null,null,null,0,null,0,0,0,0,0,0,0,0,0,0,0,0,0,0,"Proof"]
[null,null,null,null,null,null,null,null,0,null,0,0,0,0,0,0,0,0,0,0,0,0,0,0,"Proof"]
[null,null,null,null,null,null,null,null,0,null,0,0,0,0,0,0,0,0,0,0,0,0,0,0,"Proof"]
[null,null,null,null,null,null,null,null,0,null,0,0,0,0,0,0,0,0,0,0,0,0,0,0,"Proof"]
[null,null,null,null,null,null,null,null,0,null,0,0,0,0,0,0,0,0,0,0,0,0,0,0,"Proof"]
[null,null,null,null,null,null,null,null,0,null,0,0,0,0,0,0,0,0,0,0,0,0,0,0,"Proof"]
[null,null,null,null,null,null,null,null,0,null,0,0,0,0,0,0,0,0,0,0,0,0,0,0,"Proof"]
[null,null,null,null,null,null,null,null,0,null,0,0,0,0,0,0,0,0,0,0,0,0,0,0,"Proof"]
[null,null,null,null,null,null,null,null,0,null,0,0,0,0,0,0,0,0,0,0,0,0,0,0,"Proof"]
[null,null,null,null,null,null,null,null,0,null,0,0,0,0,0,0,0,0,0,0,0,0,0,0,"Proof"]
[null,null,null,null,null,null,null,null,0,null,0,0,0,0,0,0,0,0,0,0,0,0,0,0,"Proof"]
[null,null,null,null,null,null,null,null,0,null,0,0,0,0,0,0,0,0,0,0,0,0,0,0,"Proof"]
[null,null,null,null,null,null,null,null,0,null,0,0,0,0,0,0,0,0,0,0,0,0,0,0,"Proof"]
[null,null,null,null,null,null,null,null,0,null,0,0,0,0,0,0,0,0,0,0,0,0,0,0,"Proof"]
[null,null,null,null,null,null,null,null,0,null,0,0,0,0,0,0,0,0,0,0,0,0,0,0,"Proof"]
[null,null,null,null,null,null,null,null,0,null,0,0,0,0,0,0,0,0,0,0,0,0,0,0,"Proof"]
[null,null,null,null,null,null,null,null,0,null,0,0,0,0,0,0,0,0,0,0,0,0,0,0,"Proof"]
[null,null,null,null,null,null,null,null,0,null,0,0,0,0,0,0,0,0,0,0,0,0,0,0,"Proof"]
[null,null,null,null,null,null,null,null,0,null,0,0,0,0,{"$f":"IF($J303=VALUE(RIGHT(O$5,2)),$I303,0)","v":0},0,0,0,0,0,0,0,0,0,"Proof"]
[null,null,null,null,null,null,null,null,0,null,0,0,0,0,0,0,0,0,0,0,0,0,0,0,"Proof"]
[null,null,null,null,null,null,null,null,0,null,0,0,0,0,0,0,0,0,0,0,0,0,0,0,"Proof"]
[null,null,null,null,null,null,null,null,0,null,0,0,0,0,0,0,0,0,0,0,0,0,0,0,"Proof"]
[null,null,null,null,null,null,null,null,0,null,0,0,0,0,0,0,0,0,0,0,0,0,0,0,"Proof"]
[null,null,null,null,null,null,null,null,0,null,0,0,0,0,0,0,0,0,0,0,0,0,0,0,"Proof"]
[null,null,null,null,null,null,null,null,0,null,0,0,0,0,0,0,0,0,0,0,0,0,0,0,"Proof"]
[null,null,null,null,null,null,null,null,0,null,0,0,0,0,0,0,0,0,0,0,0,0,0,0,"Proof"]
[null,null,null,null,null,null,null,null,0,null,0,0,0,0,0,0,0,0,0,0,0,0,0,0,"Proof"]
[null,null,null,null,null,null,null,null,0,null,0,0,0,0,0,0,0,0,0,0,0,0,0,0,"Proof"]
[null,null,null,null,null,null,null,null,0,null,0,0,0,0,0,0,0,0,0,0,0,0,0,0,"Proof"]
[null,null,null,null,null,null,null,null,0,null,0,0,0,0,0,0,0,0,0,0,0,0,0,0,"Proof"]
[null,null,null,null,null,null,null,null,0,null,0,0,0,0,0,0,0,0,0,0,0,0,0,0,"Proof"]
[null,null,null,null,null,null,null,null,0,null,0,0,0,0,0,0,0,0,0,0,0,0,0,0,"Proof"]
[null,null,null,null,null,null,null,null,0,null,0,0,0,0,0,0,0,0,0,0,0,0,0,0,"Proof"]
[null,null,null,null,null,null,null,null,0,null,0,0,0,0,0,0,0,0,0,0,0,0,0,0,"Proof"]
[null,null,null,null,null,null,null,null,0,null,0,0,0,0,0,0,0,0,0,0,0,0,0,0,"Proof"]
[null,null,null,null,null,null,null,null,0,null,0,0,0,0,0,0,0,0,0,0,0,0,0,0,"Proof"]
[null,null,null,null,null,null,null,null,0,null,0,0,0,0,0,0,0,0,0,0,0,0,0,0,"Proof"]
[null,null,null,null,null,null,null,null,0,null,0,0,0,0,0,0,0,0,0,0,0,0,0,0,"Proof"]
[null,null,null,null,null,null,null,null,0,null,0,0,0,0,0,0,0,0,0,0,0,0,0,0,"Proof"]
[null,null,null,null,null,null,null,null,0,null,0,0,0,0,0,0,0,{"$f":"IF($J324=VALUE(RIGHT(R$5,2)),$I324,0)","v":0},0,0,0,0,0,0,"Proof"]
[null,null,null,null,null,null,null,null,0,null,0,0,0,0,0,0,0,0,0,0,0,0,0,0,"Proof"]
[null,null,null,null,null,null,null,null,0,null,0,0,0,0,0,0,0,0,0,0,0,0,0,0,"Proof"]
[null,null,null,null,null,null,null,null,0,null,0,0,0,0,0,0,0,0,0,0,0,0,0,0,"Proof"]
[null,null,null,null,null,null,null,null,0,null,0,0,0,0,0,0,0,0,0,0,0,0,0,0,"Proof"]
[null,null,null,null,null,null,null,null,0,null,0,0,0,0,0,0,0,0,0,0,0,0,0,0,"Proof"]
[null,null,null,null,null,null,null,null,{"$f":"SUM(D330:H330)","v":0},null,0,0,0,0,0,0,0,0,0,0,0,0,0,{"$f":"SUM(K330:W330)","v":0},{"$f":"IF(X330=I330,\"Proof\",\"Error\")","v":"Proof"}]
[null,null,null,null,null,null,null,null,0,null,0,0,0,0,0,0,0,0,0,0,0,0,0,0,"Proof"]
[null,null,null,null,null,null,null,null,0,null,0,0,0,0,0,0,0,0,0,0,0,0,0,0,"Proof"]
[null,null,null,null,null,null,null,null,0,null,0,0,0,0,0,0,0,0,0,0,0,0,0,0,"Proof"]
[null,null,null,null,null,null,null,null,0,null,0,0,0,0,0,0,0,0,0,0,0,0,0,0,"Proof"]
[null,null,null,null,null,null,null,null,0,null,0,0,0,0,0,0,0,0,0,0,0,0,0,0,"Proof"]
[null,null,null,null,null,null,null,null,0,null,0,0,0,0,0,0,0,0,0,0,0,0,0,0,"Proof"]
[null,null,null,null,null,null,null,null,0,null,0,0,0,0,0,0,0,0,0,0,0,0,0,0,"Proof"]
[null,null,null,null,null,null,null,null,0,null,0,0,0,0,0,0,0,0,0,0,0,0,0,0,"Proof"]
[null,null,null,null,null,null,null,null,0,null,0,0,0,0,0,0,0,0,0,0,0,0,0,0,"Proof"]
[null,null,null,null,null,null,null,null,0,null,0,0,0,0,0,0,0,0,0,0,0,0,0,0,"Proof"]
[null,null,null,null,null,null,null,null,0,null,0,0,0,0,0,0,0,0,0,0,0,0,0,0,"Proof"]
[null,null,null,null,null,null,null,null,0,null,0,0,0,0,0,0,0,0,0,0,0,0,0,0,"Proof"]
[null,null,null,null,null,null,null,null,0,null,0,0,0,0,0,0,0,0,0,0,0,0,0,0,"Proof"]
[null,null,null,null,null,null,null,null,0,null,0,0,0,0,0,0,0,0,0,0,0,0,0,0,"Proof"]
[null,null,null,null,null,null,null,null,0,null,0,0,0,0,0,0,0,0,0,0,{"$f":"IF($J345=VALUE(RIGHT(U$5,2)),$I345,0)","v":0},0,0,0,"Proof"]
[null,null,null,null,null,null,null,null,0,null,0,0,0,0,0,0,0,0,0,0,0,0,0,0,"Proof"]
[null,null,null,null,null,null,null,null,0,null,{"$f":"IF($J347=VALUE(RIGHT(K$5,2)),$I347,0)","v":0},0,0,0,0,0,0,0,0,0,0,0,0,0,"Proof"]
[null,null,null,null,null,null,null,null,0,null,0,0,0,0,0,0,0,0,0,0,0,0,0,0,"Proof"]
[null,null,null,null,null,null,null,null,0,null,0,0,0,0,0,0,0,0,0,0,0,0,0,0,"Proof"]
[null,null,null,null,null,null,null,null,0,null,0,0,0,0,0,0,0,0,0,0,0,0,0,0,"Proof"]
[null,null,null,null,null,null,null,null,0,null,0,0,0,0,0,0,0,0,0,0,0,0,0,0,"Proof"]
[null,null,null,null,null,null,null,null,0,null,0,0,0,0,0,0,0,0,0,0,0,0,0,0,"Proof"]
[null,null,null,null,null,null,null,null,0,null,0,0,0,0,0,0,0,0,0,0,0,0,0,0,"Proof"]
[null,null,null,null,null,null,null,null,0,null,0,0,0,0,0,0,0,0,0,0,0,0,0,0,"Proof"]
[null,null,null,null,null,null,null,null,0,null,0,0,0,0,0,0,0,0,0,0,0,0,0,0,"Proof"]
[null,null,null,null,null,null,null,null,0,null,0,0,0,0,0,0,0,0,0,0,0,0,0,0,"Proof"]
[null,null,null,null,null,null,null,null,0,null,0,0,0,0,0,0,0,0,0,0,0,0,0,0,"Proof"]
[null,null,null,null,null,null,null,null,0,null,0,0,0,0,0,0,0,0,0,0,0,0,0,0,"Proof"]
[null,null,null,null,null,null,null,null,0,null,0,0,0,0,0,0,0,0,0,0,0,0,0,0,"Proof"]
[null,null,null,null,null,null,null,null,0,null,0,0,0,0,0,0,0,0,0,0,0,0,0,0,"Proof"]
[null,null,null,null,null,null,null,null,0,null,0,0,0,0,0,0,0,0,0,0,0,0,0,0,"Proof"]
[null,null,null,null,null,null,null,null,0,null,0,0,0,0,0,0,0,0,0,0,0,0,0,0,"Proof"]
[null,null,null,null,null,null,null,null,0,null,0,0,0,0,0,0,0,0,0,0,0,0,0,0,"Proof"]
[null,null,null,null,null,null,null,null,0,null,0,0,0,0,0,0,0,0,0,0,0,0,0,0,"Proof"]
[null,null,null,null,null,null,null,null,0,null,0,0,0,0,0,0,0,0,0,0,0,0,0,0,"Proof"]
[null,null,null,null,null,null,null,null,0,null,0,0,0,0,0,0,0,0,0,0,0,0,0,0,"Proof"]
[null,null,null,null,null,null,null,null,0,null,0,0,0,0,0,0,0,0,0,0,0,0,0,0,"Proof"]
[null,null,null,null,null,null,null,null,0,null,0,0,0,0,0,0,0,0,0,0,0,0,0,0,"Proof"]
[null,null,null,null,null,null,null,null,0,null,0,0,0,0,0,0,0,0,0,0,0,0,0,0,"Proof"]
[null,null,null,null,null,null,null,null,0,null,0,0,0,0,0,0,0,0,0,0,0,0,0,0,"Proof"]
[null,null,null,null,null,null,null,null,0,null,0,0,0,0,0,0,0,0,0,0,0,0,0,0,"Proof"]
[null,null,null,null,null,null,null,null,0,null,0,0,0,0,0,0,0,0,0,0,0,0,0,0,"Proof"]
[null,null,null,null,null,null,null,null,0,null,0,0,0,0,0,0,0,0,0,0,0,0,0,0,"Proof"]
[null,null,null,null,null,null,null,null,0,null,0,0,0,0,0,0,0,0,0,0,0,0,0,0,"Proof"]
[null,null,null,null,null,null,null,null,0,null,0,0,0,0,0,0,0,0,0,0,0,0,0,0,"Proof"]
[null,null,null,null,null,null,null,null,0,null,0,0,0,0,0,0,0,0,0,0,0,0,0,0,"Proof"]
[null,null,null,null,null,null,null,null,0,null,0,0,0,0,0,0,0,0,0,0,0,0,0,0,"Proof"]
[null,null,null,null,null,null,null,null,0,null,0,0,0,0,0,0,0,0,0,0,0,0,0,0,"Proof"]
[null,null,null,null,null,null,null,null,0,null,0,0,0,0,0,0,0,0,0,0,0,0,0,0,"Proof"]
[null,null,null,null,null,null,null,null,0,null,0,0,0,0,0,0,0,0,0,0,0,0,0,0,"Proof"]
[null,null,null,null,null,null,null,null,0,null,0,0,0,0,0,0,0,0,0,0,0,0,0,0,"Proof"]
[null,null,null,null,null,null,null,null,0,null,0,0,0,0,0,0,0,0,0,0,0,0,0,0,"Proof"]
[null,null,null,null,null,null,null,null,0,null,0,0,0,0,0,0,0,0,0,0,0,0,0,0,"Proof"]
[null,null,null,null,null,null,null,null,0,null,0,0,0,0,0,0,0,0,0,0,0,0,0,0,"Proof"]
[null,null,null,null,null,null,null,null,0,null,0,{"$f":"IF($J385=VALUE(RIGHT(L$5,2)),$I385,0)","v":0},0,0,0,0,0,0,0,0,0,0,0,0,"Proof"]
[null,null,null,null,null,null,null,null,0,null,{"$f":"IF($J386=VALUE(RIGHT(K$5,2)),$I386,0)","v":0},0,0,0,0,0,0,0,0,0,0,0,0,0,"Proof"]
[null,null,null,null,null,null,null,null,0,null,0,0,0,0,0,0,0,0,0,0,0,0,0,0,"Proof"]
[null,null,null,null,null,null,null,null,0,null,0,0,0,0,0,0,0,0,0,0,0,0,0,0,"Proof"]
[null,null,null,null,null,null,null,null,0,null,0,0,0,0,0,0,0,0,0,0,0,0,0,0,"Proof"]
[null,null,null,null,null,null,null,null,0,null,0,0,0,0,0,0,0,0,0,0,0,0,0,0,"Proof"]
[null,null,null,null,null,null,null,null,0,null,0,0,0,0,0,0,0,0,0,0,0,0,0,0,"Proof"]
[null,null,null,null,null,null,null,null,0,null,0,0,0,0,0,0,0,0,0,0,0,0,0,0,"Proof"]
[null,null,null,null,null,null,null,null,0,null,0,0,0,0,0,0,0,0,0,0,0,0,0,0,"Proof"]
[null,null,null,null,null,null,null,null,{"$f":"SUM(D394:H394)","v":0},null,0,0,0,0,0,0,0,0,0,0,0,0,0,{"$f":"SUM(K394:W394)","v":0},{"$f":"IF(X394=I394,\"Proof\",\"Error\")","v":"Proof"}]
[null,null,null,null,null,null,null,null,0,null,0,0,0,0,0,0,0,0,0,0,0,0,0,0,"Proof"]
[null,null,null,null,null,null,null,null,0,null,0,0,0,0,0,0,0,0,0,0,0,0,0,0,"Proof"]
[null,null,null,null,null,null,null,null,0,null,0,0,0,0,0,0,0,0,0,0,0,0,0,0,"Proof"]
[null,null,null,null,null,null,null,null,0,null,0,0,0,0,0,0,0,0,0,0,0,0,0,0,"Proof"]
[null,null,null,null,null,null,null,null,0,null,0,0,0,0,0,0,0,0,0,0,0,0,0,0,"Proof"]
[null,null,null,null,null,null,null,null,0,null,0,0,0,0,0,0,0,0,0,0,0,0,0,0,"Proof"]
[null,null,null,null,null,null,null,null,0,null,0,0,0,0,0,0,0,0,0,0,0,0,0,0,"Proof"]
[null,null,null,null,null,null,null,null,0,null,0,0,0,0,0,0,0,0,0,0,0,0,0,0,"Proof"]
[null,null,null,null,null,null,null,null,0,null,0,0,0,0,0,0,0,0,0,0,0,0,0,0,"Proof"]
[null,null,null,null,null,null,null,null,0,null,0,0,0,0,0,0,0,0,0,0,0,0,0,0,"Proof"]
[null,null,null,null,null,null,null,null,0,null,0,0,0,0,0,0,0,0,0,0,0,0,0,0,"Proof"]
[null,null,null,null,null,null,null,null,0,null,0,0,0,0,{"$f":"IF($J406=VALUE(RIGHT(O$5,2)),$I406,0)","v":0},0,0,0,0,0,0,0,0,0,"Proof"]
[null,null,null,null,null,null,null,null,0,null,0,0,0,0,0,0,0,0,0,0,0,0,0,0,"Proof"]
[null,null,null,null,null,null,null,null,0,null,0,0,0,0,0,0,0,0,0,0,0,0,0,0,"Proof"]
[null,null,null,null,null,null,null,null,0,null,0,0,0,0,0,0,0,0,0,0,0,0,0,0,"Proof"]
[null,null,null,null,null,null,null,null,0,null,0,0,0,0,0,0,0,0,0,0,0,0,0,0,"Proof"]
[null,null,null,null,null,null,null,null,0,null,0,0,0,0,0,0,0,0,0,0,0,0,0,0,"Proof"]
[null,null,null,null,null,null,null,null,0,null,0,0,0,0,0,0,0,0,0,0,0,0,0,0,"Proof"]
[null,null,null,null,null,null,null,null,0,null,0,0,0,0,0,0,0,0,0,0,0,0,0,0,"Proof"]
[null,null,null,null,null,null,null,null,0,null,0,0,0,0,0,0,0,0,0,0,0,0,0,0,"Proof"]
[null,null,null,null,null,null,null,null,0,null,0,0,0,0,0,0,0,0,0,0,0,0,0,0,"Proof"]
[null,null,null,null,null,null,null,null,0,null,0,0,0,0,0,0,0,0,0,0,0,0,0,0,"Proof"]
[null,null,null,null,null,null,null,null,0,null,0,0,0,0,0,0,0,0,0,0,0,0,0,0,"Proof"]
[null,null,null,null,null,null,null,null,0,null,0,0,0,0,0,0,0,0,0,0,0,0,0,0,"Proof"]
[null,null,null,null,null,null,null,null,0,null,0,0,0,0,0,0,0,0,0,0,0,0,0,0,"Proof"]
[null,null,null,null,null,null,null,null,0,null,0,0,0,0,0,0,0,0,0,0,0,0,0,0,"Proof"]
[null,null,null,null,null,null,null,null,0,null,0,0,0,0,0,0,0,0,0,0,0,0,0,0,"Proof"]
[null,null,null,null,null,null,null,null,0,null,0,0,0,0,0,0,0,0,0,0,0,0,0,0,"Proof"]
[null,null,null,null,null,null,null,null,0,null,0,0,0,0,0,0,0,0,0,0,0,0,0,0,"Proof"]
[null,null,null,null,null,null,null,null,0,null,0,0,0,0,0,0,0,0,0,0,0,0,0,0,"Proof"]
[null,null,null,null,null,null,null,null,0,null,0,0,0,0,0,0,0,0,0,0,0,0,0,0,"Proof"]
[null,null,null,null,null,null,null,null,0,null,0,0,0,0,0,0,0,0,0,0,0,0,0,0,"Proof"]
[null,null,null,null,null,null,null,null,0,null,0,0,0,0,0,0,0,{"$f":"IF($J427=VALUE(RIGHT(R$5,2)),$I427,0)","v":0},0,0,0,0,0,0,"Proof"]
[null,null,null,null,null,null,null,null,0,null,0,0,0,0,0,0,0,0,0,0,0,0,0,0,"Proof"]
[null,null,null,null,null,null,null,null,0,null,0,0,0,0,0,0,0,0,0,0,0,0,0,0,"Proof"]
[null,null,null,null,null,null,null,null,0,null,0,0,0,0,0,0,0,0,0,0,0,0,0,0,"Proof"]
[null,null,null,null,null,null,null,null,0,null,0,0,0,0,0,0,0,0,0,0,0,0,0,0,"Proof"]
[null,null,null,null,null,null,null,null,0,null,0,0,0,0,0,0,0,0,0,0,0,0,0,0,"Proof"]
[null,null,null,null,null,null,null,null,0,null,0,0,0,0,0,0,0,0,0,0,0,0,0,0,"Proof"]
[null,null,null,null,null,null,null,null,0,null,0,0,0,0,0,0,0,0,0,0,0,0,0,0,"Proof"]
[null,null,null,null,null,null,null,null,0,null,0,0,0,0,0,0,0,0,0,0,0,0,0,0,"Proof"]
[null,null,null,null,null,null,null,null,0,null,0,0,0,0,0,0,0,0,0,0,0,0,0,0,"Proof"]
[null,null,null,null,null,null,null,null,0,null,0,0,0,0,0,0,0,0,0,0,0,0,0,0,"Proof"]
[null,null,null,null,null,null,null,null,0,null,0,0,0,0,0,0,0,0,0,0,0,0,0,0,"Proof"]
[null,null,null,null,null,null,null,null,0,null,0,0,0,0,0,0,0,0,0,0,0,0,0,0,"Proof"]
[null,null,null,null,null,null,null,null,0,null,0,0,0,0,0,0,0,0,0,0,0,0,0,0,"Proof"]
[null,null,null,null,null,null,null,null,0,null,0,0,0,0,0,0,0,0,0,0,0,0,0,0,"Proof"]
[null,null,null,null,null,null,null,null,0,null,0,0,0,0,0,0,0,0,0,0,0,0,0,0,"Proof"]
[null,null,null,null,null,null,null,null,0,null,0,0,0,0,0,0,0,0,0,0,0,0,0,0,"Proof"]
[null,null,null,null,null,null,null,null,0,null,0,0,0,0,0,0,0,0,0,0,0,0,0,0,"Proof"]
[null,null,null,null,null,null,null,null,0,null,0,0,0,0,0,0,0,0,0,0,0,0,0,0,"Proof"]
[null,null,null,null,null,null,null,null,0,null,0,0,0,0,0,0,0,0,0,0,0,0,0,0,"Proof"]
[null,null,null,null,null,null,null,null,0,null,0,0,0,0,0,0,0,0,0,0,0,0,0,0,"Proof"]
[null,null,null,null,null,null,null,null,0,null,0,0,0,0,0,0,0,0,0,0,{"$f":"IF($J448=VALUE(RIGHT(U$5,2)),$I448,0)","v":0},0,0,0,"Proof"]
[null,null,null,null,null,null,null,null,0,null,0,0,0,0,0,0,0,0,0,0,0,0,0,0,"Proof"]
[null,null,null,null,null,null,null,null,0,null,{"$f":"IF($J450=VALUE(RIGHT(K$5,2)),$I450,0)","v":0},0,0,0,0,0,0,0,0,0,0,0,0,0,"Proof"]
[null,null,null,null,null,null,null,null,0,null,0,0,0,0,0,0,0,0,0,0,0,0,0,0,"Proof"]
[null,null,null,null,null,null,null,null,0,null,0,0,0,0,0,0,0,0,0,0,0,0,0,0,"Proof"]
[null,null,null,null,null,null,null,null,0,null,0,0,0,0,0,0,0,0,0,0,0,0,0,0,"Proof"]
[null,null,null,null,null,null,null,null,0,null,0,0,0,0,0,0,0,0,0,0,0,0,0,0,"Proof"]
[null,null,null,null,null,null,null,null,0,null,0,0,0,0,0,0,0,0,0,0,0,0,0,0,"Proof"]
[null,null,null,null,null,null,null,null,0,null,0,0,0,0,0,0,0,0,0,0,0,0,0,0,"Proof"]
[null,null,null,null,null,null,null,null,0,null,0,0,0,0,0,0,0,0,0,0,0,0,0,0,"Proof"]
[null,null,null,null,null,null,null,null,{"$f":"SUM(D458:H458)","v":0},null,0,0,0,0,0,0,0,0,0,0,0,0,0,{"$f":"SUM(K458:W458)","v":0},{"$f":"IF(X458=I458,\"Proof\",\"Error\")","v":"Proof"}]
[null,null,null,null,null,null,null,null,0,null,0,0,0,0,0,0,0,0,0,0,0,0,0,0,"Proof"]
[null,null,null,null,null,null,null,null,0,null,0,0,0,0,0,0,0,0,0,0,0,0,0,0,"Proof"]
[null,null,null,null,null,null,null,null,0,null,0,0,0,0,0,0,0,0,0,0,0,0,0,0,"Proof"]
[null,null,null,null,null,null,null,null,0,null,0,0,0,0,0,0,0,0,0,0,0,0,0,0,"Proof"]
[null,null,null,null,null,null,null,null,0,null,0,0,0,0,0,0,0,0,0,0,0,0,0,0,"Proof"]
[null,null,null,null,null,null,null,null,0,null,0,0,0,0,0,0,0,0,0,0,0,0,0,0,"Proof"]
[null,null,null,null,null,null,null,null,0,null,0,0,0,0,0,0,0,0,0,0,0,0,0,0,"Proof"]
[null,null,null,null,null,null,null,null,0,null,0,0,0,0,0,0,0,0,0,0,0,0,0,0,"Proof"]
[null,null,null,null,null,null,null,null,0,null,0,0,0,0,0,0,0,0,0,0,0,0,0,0,"Proof"]
[null,null,null,null,null,null,null,null,0,null,0,0,0,0,0,0,0,0,0,0,0,0,0,0,"Proof"]
[null,null,null,null,null,null,null,null,0,null,0,0,0,0,0,0,0,0,0,0,0,0,0,0,"Proof"]
[null,null,null,null,null,null,null,null,0,null,0,0,0,0,0,0,0,0,0,0,0,0,0,0,"Proof"]
[null,null,null,null,null,null,null,null,0,null,0,0,0,0,0,0,0,0,0,0,0,0,0,0,"Proof"]
[null,null,null,null,null,null,null,null,0,null,0,0,0,0,0,0,0,0,0,0,0,0,0,0,"Proof"]
[null,null,null,null,null,null,null,null,0,null,0,0,0,0,0,0,0,0,0,0,0,0,0,0,"Proof"]
[null,null,null,null,null,null,null,null,0,null,0,0,0,0,0,0,0,0,0,0,0,0,0,0,"Proof"]
[null,null,null,null,null,null,null,null,0,null,0,0,0,0,0,0,0,0,0,0,0,0,0,0,"Proof"]
[null,null,null,null,null,null,null,null,0,null,0,0,0,0,0,0,0,0,0,0,0,0,0,0,"Proof"]
[null,null,null,null,null,null,null,null,0,null,0,0,0,0,0,0,0,0,0,0,0,0,0,0,"Proof"]
[null,null,null,null,null,null,null,null,0,null,0,0,0,0,0,0,0,0,0,0,0,0,0,0,"Proof"]
[null,null,null,null,null,null,null,null,0,null,0,0,0,0,0,0,0,0,0,0,0,0,0,0,"Proof"]
[null,null,null,null,null,null,null,null,0,null,0,0,0,0,0,0,0,0,0,0,0,0,0,0,"Proof"]
[null,null,null,null,null,null,null,null,0,null,0,0,0,0,0,0,0,0,0,0,0,0,0,0,"Proof"]
[null,null,null,null,null,null,null,null,0,null,0,0,0,0,0,0,0,0,0,0,0,0,0,0,"Proof"]
[null,null,null,null,null,null,null,null,0,null,0,0,0,0,0,0,0,0,0,0,0,0,0,0,"Proof"]
[null,null,null,null,null,null,null,null,0,null,0,0,0,0,0,0,0,0,0,0,0,0,0,0,"Proof"]
[null,null,null,null,null,null,null,null,0,null,0,0,0,0,0,0,0,0,0,0,0,0,0,0,"Proof"]
[null,null,null,null,null,null,null,null,0,null,0,0,0,0,0,0,0,0,0,0,0,0,0,0,"Proof"]
[null,null,null,null,null,null,null,null,0,null,0,0,0,0,0,0,0,0,0,0,0,0,0,0,"Proof"]
[null,null,null,null,null,null,null,null,0,null,0,{"$f":"IF($J488=VALUE(RIGHT(L$5,2)),$I488,0)","v":0},0,0,0,0,0,0,0,0,0,0,0,0,"Proof"]
[null,null,null,null,null,null,null,null,0,null,{"$f":"IF($J489=VALUE(RIGHT(K$5,2)),$I489,0)","v":0},0,0,0,0,0,0,0,0,0,0,0,0,0,"Proof"]
[null,null,null,null,null,null,null,null,0,null,0,0,0,0,0,0,0,0,0,0,0,0,0,0,"Proof"]
[null,null,null,null,null,null,null,null,0,null,0,0,0,0,0,0,0,0,0,0,0,0,0,0,"Proof"]
[null,null,null,null,null,null,null,null,0,null,0,0,0,0,0,0,0,0,0,0,0,0,0,0,"Proof"]
[null,null,null,null,null,null,null,null,0,null,0,0,0,0,0,0,0,0,0,0,0,0,0,0,"Proof"]
[null,null,null,null,null,null,null,null,0,null,0,0,0,0,0,0,0,0,0,0,0,0,0,0,"Proof"]
[null,null,null,null,null,null,null,null,0,null,0,0,0,0,0,0,0,0,0,0,0,0,0,0,"Proof"]
[null,null,null,null,null,null,null,null,0,null,0,0,0,0,0,0,0,0,0,0,0,0,0,0,"Proof"]
[null,null,null,null,null,null,null,null,0,null,0,0,0,0,0,0,0,0,0,0,0,0,0,0,"Proof"]
[null,null,null,null,null,null,null,null,0,null,0,0,0,0,0,0,0,0,0,0,0,0,0,0,"Proof"]
[null,null,null,null,null,null,null,null,0,null,0,0,0,0,0,0,0,0,0,0,0,0,0,0,"Proof"]
[null,null,null,null,null,null,null,null,0,null,0,0,0,0,0,0,0,0,0,0,0,0,0,0,"Proof"]
[null,null,null,null,null,null,null,null,null,"CASH FLOW TEMPLATE ENDS HERE.  IF YOU NEED MORE ROWS, INSERT THEM ABOVE ROW 500. "]

{"sheet":"Import","index":5,"n_rows":0,"n_cols":0,"rows_kept":0,"cut":false,"hidden":false,"merged":[]}

{"sheet":"Alert","index":6,"n_rows":0,"n_cols":0,"rows_kept":0,"cut":false,"hidden":true,"merged":[[0,0,63,36]]}